Skip to content
Failed

Console Output

Skipping 278 KB.. Full Log
ERROR -- flag18 / fire
Traceback (most recent call last):
  File "/home/jenkins/workspace/run_bindiff_w_varying_flags_against_master/bindiff_against_master/master/clubb/run_scripts/../utilities/create_case_namelist.py", line 841, in <module>
    main()
  File "/home/jenkins/workspace/run_bindiff_w_varying_flags_against_master/bindiff_against_master/master/clubb/run_scripts/../utilities/create_case_namelist.py", line 812, in main
    clubb_input_namelist = create_case_namelist_file(
  File "/home/jenkins/workspace/run_bindiff_w_varying_flags_against_master/bindiff_against_master/master/clubb/run_scripts/../utilities/create_case_namelist.py", line 465, in create_case_namelist_file
    clubb_in = apply_namelist_overrides(args, clubb_in, model_file, output_dir_abs)
  File "/home/jenkins/workspace/run_bindiff_w_varying_flags_against_master/bindiff_against_master/master/clubb/run_scripts/../utilities/create_case_namelist.py", line 356, in apply_namelist_overrides
    clubb_in = override_value(args.override, clubb_in)
  File "/home/jenkins/workspace/run_bindiff_w_varying_flags_against_master/bindiff_against_master/master/clubb/run_scripts/../utilities/create_case_namelist.py", line 251, in override_value
    raise ValueError(
ValueError: Override setting 'l_rtm_nudge' is not present in the selected namelists
Output directory: /home/jenkins/workspace/run_bindiff_w_varying_flags_against_master/bindiff_against_master/master/clubb/output/flag18
--------------------------------------------------
run_scm.py total runtime: 0.12 s
--------------------------------------------------
create_case_namelist failed (exit 1). Command was:
  /usr/bin/python3 /home/jenkins/workspace/run_bindiff_w_varying_flags_against_master/bindiff_against_master/master/clubb/run_scripts/../utilities/create_case_namelist.py -out_dir /home/jenkins/workspace/run_bindiff_w_varying_flags_against_master/bindiff_against_master/master/clubb/output/flag18 -debug 0 -max_iters 360 -override ipdf_call_placement=3,l_rtm_nudge=.true. fire

ERROR -- flag18 / gabls3
Traceback (most recent call last):
  File "/home/jenkins/workspace/run_bindiff_w_varying_flags_against_master/bindiff_against_master/master/clubb/run_scripts/../utilities/create_case_namelist.py", line 841, in <module>
    main()
  File "/home/jenkins/workspace/run_bindiff_w_varying_flags_against_master/bindiff_against_master/master/clubb/run_scripts/../utilities/create_case_namelist.py", line 812, in main
    clubb_input_namelist = create_case_namelist_file(
  File "/home/jenkins/workspace/run_bindiff_w_varying_flags_against_master/bindiff_against_master/master/clubb/run_scripts/../utilities/create_case_namelist.py", line 465, in create_case_namelist_file
    clubb_in = apply_namelist_overrides(args, clubb_in, model_file, output_dir_abs)
  File "/home/jenkins/workspace/run_bindiff_w_varying_flags_against_master/bindiff_against_master/master/clubb/run_scripts/../utilities/create_case_namelist.py", line 356, in apply_namelist_overrides
    clubb_in = override_value(args.override, clubb_in)
  File "/home/jenkins/workspace/run_bindiff_w_varying_flags_against_master/bindiff_against_master/master/clubb/run_scripts/../utilities/create_case_namelist.py", line 251, in override_value
    raise ValueError(
ValueError: Override setting 'l_rtm_nudge' is not present in the selected namelists
Output directory: /home/jenkins/workspace/run_bindiff_w_varying_flags_against_master/bindiff_against_master/master/clubb/output/flag18
--------------------------------------------------
run_scm.py total runtime: 0.12 s
--------------------------------------------------
create_case_namelist failed (exit 1). Command was:
  /usr/bin/python3 /home/jenkins/workspace/run_bindiff_w_varying_flags_against_master/bindiff_against_master/master/clubb/run_scripts/../utilities/create_case_namelist.py -out_dir /home/jenkins/workspace/run_bindiff_w_varying_flags_against_master/bindiff_against_master/master/clubb/output/flag18 -debug 0 -max_iters 360 -override ipdf_call_placement=3,l_rtm_nudge=.true. gabls3

ERROR -- flag18 / gabls3_night
Traceback (most recent call last):
  File "/home/jenkins/workspace/run_bindiff_w_varying_flags_against_master/bindiff_against_master/master/clubb/run_scripts/../utilities/create_case_namelist.py", line 841, in <module>
    main()
  File "/home/jenkins/workspace/run_bindiff_w_varying_flags_against_master/bindiff_against_master/master/clubb/run_scripts/../utilities/create_case_namelist.py", line 812, in main
    clubb_input_namelist = create_case_namelist_file(
  File "/home/jenkins/workspace/run_bindiff_w_varying_flags_against_master/bindiff_against_master/master/clubb/run_scripts/../utilities/create_case_namelist.py", line 465, in create_case_namelist_file
    clubb_in = apply_namelist_overrides(args, clubb_in, model_file, output_dir_abs)
  File "/home/jenkins/workspace/run_bindiff_w_varying_flags_against_master/bindiff_against_master/master/clubb/run_scripts/../utilities/create_case_namelist.py", line 356, in apply_namelist_overrides
    clubb_in = override_value(args.override, clubb_in)
  File "/home/jenkins/workspace/run_bindiff_w_varying_flags_against_master/bindiff_against_master/master/clubb/run_scripts/../utilities/create_case_namelist.py", line 251, in override_value
    raise ValueError(
ValueError: Override setting 'l_rtm_nudge' is not present in the selected namelists
Output directory: /home/jenkins/workspace/run_bindiff_w_varying_flags_against_master/bindiff_against_master/master/clubb/output/flag18
--------------------------------------------------
run_scm.py total runtime: 0.12 s
--------------------------------------------------
create_case_namelist failed (exit 1). Command was:
  /usr/bin/python3 /home/jenkins/workspace/run_bindiff_w_varying_flags_against_master/bindiff_against_master/master/clubb/run_scripts/../utilities/create_case_namelist.py -out_dir /home/jenkins/workspace/run_bindiff_w_varying_flags_against_master/bindiff_against_master/master/clubb/output/flag18 -debug 0 -max_iters 360 -override ipdf_call_placement=3,l_rtm_nudge=.true. gabls3_night

ERROR -- flag18 / jun25_altocu
Traceback (most recent call last):
  File "/home/jenkins/workspace/run_bindiff_w_varying_flags_against_master/bindiff_against_master/master/clubb/run_scripts/../utilities/create_case_namelist.py", line 841, in <module>
    main()
  File "/home/jenkins/workspace/run_bindiff_w_varying_flags_against_master/bindiff_against_master/master/clubb/run_scripts/../utilities/create_case_namelist.py", line 812, in main
    clubb_input_namelist = create_case_namelist_file(
  File "/home/jenkins/workspace/run_bindiff_w_varying_flags_against_master/bindiff_against_master/master/clubb/run_scripts/../utilities/create_case_namelist.py", line 465, in create_case_namelist_file
    clubb_in = apply_namelist_overrides(args, clubb_in, model_file, output_dir_abs)
  File "/home/jenkins/workspace/run_bindiff_w_varying_flags_against_master/bindiff_against_master/master/clubb/run_scripts/../utilities/create_case_namelist.py", line 356, in apply_namelist_overrides
    clubb_in = override_value(args.override, clubb_in)
  File "/home/jenkins/workspace/run_bindiff_w_varying_flags_against_master/bindiff_against_master/master/clubb/run_scripts/../utilities/create_case_namelist.py", line 251, in override_value
    raise ValueError(
ValueError: Override setting 'l_rtm_nudge' is not present in the selected namelists
Output directory: /home/jenkins/workspace/run_bindiff_w_varying_flags_against_master/bindiff_against_master/master/clubb/output/flag18
--------------------------------------------------
run_scm.py total runtime: 0.12 s
--------------------------------------------------
create_case_namelist failed (exit 1). Command was:
  /usr/bin/python3 /home/jenkins/workspace/run_bindiff_w_varying_flags_against_master/bindiff_against_master/master/clubb/run_scripts/../utilities/create_case_namelist.py -out_dir /home/jenkins/workspace/run_bindiff_w_varying_flags_against_master/bindiff_against_master/master/clubb/output/flag18 -debug 0 -max_iters 360 -override ipdf_call_placement=3,l_rtm_nudge=.true. jun25_altocu

ERROR -- flag18 / lba
Traceback (most recent call last):
  File "/home/jenkins/workspace/run_bindiff_w_varying_flags_against_master/bindiff_against_master/master/clubb/run_scripts/../utilities/create_case_namelist.py", line 841, in <module>
    main()
  File "/home/jenkins/workspace/run_bindiff_w_varying_flags_against_master/bindiff_against_master/master/clubb/run_scripts/../utilities/create_case_namelist.py", line 812, in main
    clubb_input_namelist = create_case_namelist_file(
  File "/home/jenkins/workspace/run_bindiff_w_varying_flags_against_master/bindiff_against_master/master/clubb/run_scripts/../utilities/create_case_namelist.py", line 465, in create_case_namelist_file
    clubb_in = apply_namelist_overrides(args, clubb_in, model_file, output_dir_abs)
  File "/home/jenkins/workspace/run_bindiff_w_varying_flags_against_master/bindiff_against_master/master/clubb/run_scripts/../utilities/create_case_namelist.py", line 356, in apply_namelist_overrides
    clubb_in = override_value(args.override, clubb_in)
  File "/home/jenkins/workspace/run_bindiff_w_varying_flags_against_master/bindiff_against_master/master/clubb/run_scripts/../utilities/create_case_namelist.py", line 251, in override_value
    raise ValueError(
ValueError: Override setting 'l_rtm_nudge' is not present in the selected namelists
Output directory: /home/jenkins/workspace/run_bindiff_w_varying_flags_against_master/bindiff_against_master/master/clubb/output/flag18
--------------------------------------------------
run_scm.py total runtime: 0.16 s
--------------------------------------------------
create_case_namelist failed (exit 1). Command was:
  /usr/bin/python3 /home/jenkins/workspace/run_bindiff_w_varying_flags_against_master/bindiff_against_master/master/clubb/run_scripts/../utilities/create_case_namelist.py -out_dir /home/jenkins/workspace/run_bindiff_w_varying_flags_against_master/bindiff_against_master/master/clubb/output/flag18 -debug 0 -max_iters 360 -override ipdf_call_placement=3,l_rtm_nudge=.true. lba

ERROR -- flag18 / mc3e
Traceback (most recent call last):
  File "/home/jenkins/workspace/run_bindiff_w_varying_flags_against_master/bindiff_against_master/master/clubb/run_scripts/../utilities/create_case_namelist.py", line 841, in <module>
    main()
  File "/home/jenkins/workspace/run_bindiff_w_varying_flags_against_master/bindiff_against_master/master/clubb/run_scripts/../utilities/create_case_namelist.py", line 812, in main
    clubb_input_namelist = create_case_namelist_file(
  File "/home/jenkins/workspace/run_bindiff_w_varying_flags_against_master/bindiff_against_master/master/clubb/run_scripts/../utilities/create_case_namelist.py", line 465, in create_case_namelist_file
    clubb_in = apply_namelist_overrides(args, clubb_in, model_file, output_dir_abs)
  File "/home/jenkins/workspace/run_bindiff_w_varying_flags_against_master/bindiff_against_master/master/clubb/run_scripts/../utilities/create_case_namelist.py", line 356, in apply_namelist_overrides
    clubb_in = override_value(args.override, clubb_in)
  File "/home/jenkins/workspace/run_bindiff_w_varying_flags_against_master/bindiff_against_master/master/clubb/run_scripts/../utilities/create_case_namelist.py", line 251, in override_value
    raise ValueError(
ValueError: Override setting 'l_rtm_nudge' is not present in the selected namelists
Output directory: /home/jenkins/workspace/run_bindiff_w_varying_flags_against_master/bindiff_against_master/master/clubb/output/flag18
--------------------------------------------------
run_scm.py total runtime: 0.12 s
--------------------------------------------------
create_case_namelist failed (exit 1). Command was:
  /usr/bin/python3 /home/jenkins/workspace/run_bindiff_w_varying_flags_against_master/bindiff_against_master/master/clubb/run_scripts/../utilities/create_case_namelist.py -out_dir /home/jenkins/workspace/run_bindiff_w_varying_flags_against_master/bindiff_against_master/master/clubb/output/flag18 -debug 0 -max_iters 360 -override ipdf_call_placement=3,l_rtm_nudge=.true. mc3e

COMPLETE -- flag17 / nov11_altocu
ERROR -- flag18 / mpace_a
Traceback (most recent call last):
  File "/home/jenkins/workspace/run_bindiff_w_varying_flags_against_master/bindiff_against_master/master/clubb/run_scripts/../utilities/create_case_namelist.py", line 841, in <module>
    main()
  File "/home/jenkins/workspace/run_bindiff_w_varying_flags_against_master/bindiff_against_master/master/clubb/run_scripts/../utilities/create_case_namelist.py", line 812, in main
    clubb_input_namelist = create_case_namelist_file(
  File "/home/jenkins/workspace/run_bindiff_w_varying_flags_against_master/bindiff_against_master/master/clubb/run_scripts/../utilities/create_case_namelist.py", line 465, in create_case_namelist_file
    clubb_in = apply_namelist_overrides(args, clubb_in, model_file, output_dir_abs)
  File "/home/jenkins/workspace/run_bindiff_w_varying_flags_against_master/bindiff_against_master/master/clubb/run_scripts/../utilities/create_case_namelist.py", line 356, in apply_namelist_overrides
    clubb_in = override_value(args.override, clubb_in)
  File "/home/jenkins/workspace/run_bindiff_w_varying_flags_against_master/bindiff_against_master/master/clubb/run_scripts/../utilities/create_case_namelist.py", line 251, in override_value
    raise ValueError(
ValueError: Override setting 'l_rtm_nudge' is not present in the selected namelists
Output directory: /home/jenkins/workspace/run_bindiff_w_varying_flags_against_master/bindiff_against_master/master/clubb/output/flag18
--------------------------------------------------
run_scm.py total runtime: 0.12 s
--------------------------------------------------
create_case_namelist failed (exit 1). Command was:
  /usr/bin/python3 /home/jenkins/workspace/run_bindiff_w_varying_flags_against_master/bindiff_against_master/master/clubb/run_scripts/../utilities/create_case_namelist.py -out_dir /home/jenkins/workspace/run_bindiff_w_varying_flags_against_master/bindiff_against_master/master/clubb/output/flag18 -debug 0 -max_iters 360 -override ipdf_call_placement=3,l_rtm_nudge=.true. mpace_a

ERROR -- flag18 / mpace_b
Traceback (most recent call last):
  File "/home/jenkins/workspace/run_bindiff_w_varying_flags_against_master/bindiff_against_master/master/clubb/run_scripts/../utilities/create_case_namelist.py", line 841, in <module>
    main()
  File "/home/jenkins/workspace/run_bindiff_w_varying_flags_against_master/bindiff_against_master/master/clubb/run_scripts/../utilities/create_case_namelist.py", line 812, in main
    clubb_input_namelist = create_case_namelist_file(
  File "/home/jenkins/workspace/run_bindiff_w_varying_flags_against_master/bindiff_against_master/master/clubb/run_scripts/../utilities/create_case_namelist.py", line 465, in create_case_namelist_file
    clubb_in = apply_namelist_overrides(args, clubb_in, model_file, output_dir_abs)
  File "/home/jenkins/workspace/run_bindiff_w_varying_flags_against_master/bindiff_against_master/master/clubb/run_scripts/../utilities/create_case_namelist.py", line 356, in apply_namelist_overrides
    clubb_in = override_value(args.override, clubb_in)
  File "/home/jenkins/workspace/run_bindiff_w_varying_flags_against_master/bindiff_against_master/master/clubb/run_scripts/../utilities/create_case_namelist.py", line 251, in override_value
    raise ValueError(
ValueError: Override setting 'l_rtm_nudge' is not present in the selected namelists
Output directory: /home/jenkins/workspace/run_bindiff_w_varying_flags_against_master/bindiff_against_master/master/clubb/output/flag18
--------------------------------------------------
run_scm.py total runtime: 0.12 s
--------------------------------------------------
create_case_namelist failed (exit 1). Command was:
  /usr/bin/python3 /home/jenkins/workspace/run_bindiff_w_varying_flags_against_master/bindiff_against_master/master/clubb/run_scripts/../utilities/create_case_namelist.py -out_dir /home/jenkins/workspace/run_bindiff_w_varying_flags_against_master/bindiff_against_master/master/clubb/output/flag18 -debug 0 -max_iters 360 -override ipdf_call_placement=3,l_rtm_nudge=.true. mpace_b

ERROR -- flag18 / mpace_b_silhs
Traceback (most recent call last):
  File "/home/jenkins/workspace/run_bindiff_w_varying_flags_against_master/bindiff_against_master/master/clubb/run_scripts/../utilities/create_case_namelist.py", line 841, in <module>
    main()
  File "/home/jenkins/workspace/run_bindiff_w_varying_flags_against_master/bindiff_against_master/master/clubb/run_scripts/../utilities/create_case_namelist.py", line 812, in main
    clubb_input_namelist = create_case_namelist_file(
  File "/home/jenkins/workspace/run_bindiff_w_varying_flags_against_master/bindiff_against_master/master/clubb/run_scripts/../utilities/create_case_namelist.py", line 465, in create_case_namelist_file
    clubb_in = apply_namelist_overrides(args, clubb_in, model_file, output_dir_abs)
  File "/home/jenkins/workspace/run_bindiff_w_varying_flags_against_master/bindiff_against_master/master/clubb/run_scripts/../utilities/create_case_namelist.py", line 356, in apply_namelist_overrides
    clubb_in = override_value(args.override, clubb_in)
  File "/home/jenkins/workspace/run_bindiff_w_varying_flags_against_master/bindiff_against_master/master/clubb/run_scripts/../utilities/create_case_namelist.py", line 251, in override_value
    raise ValueError(
ValueError: Override setting 'l_rtm_nudge' is not present in the selected namelists
Output directory: /home/jenkins/workspace/run_bindiff_w_varying_flags_against_master/bindiff_against_master/master/clubb/output/flag18
--------------------------------------------------
run_scm.py total runtime: 0.11 s
--------------------------------------------------
create_case_namelist failed (exit 1). Command was:
  /usr/bin/python3 /home/jenkins/workspace/run_bindiff_w_varying_flags_against_master/bindiff_against_master/master/clubb/run_scripts/../utilities/create_case_namelist.py -out_dir /home/jenkins/workspace/run_bindiff_w_varying_flags_against_master/bindiff_against_master/master/clubb/output/flag18 -debug 0 -max_iters 360 -override ipdf_call_placement=3,l_rtm_nudge=.true. mpace_b_silhs

ERROR -- flag18 / nov11_altocu
Traceback (most recent call last):
  File "/home/jenkins/workspace/run_bindiff_w_varying_flags_against_master/bindiff_against_master/master/clubb/run_scripts/../utilities/create_case_namelist.py", line 841, in <module>
    main()
  File "/home/jenkins/workspace/run_bindiff_w_varying_flags_against_master/bindiff_against_master/master/clubb/run_scripts/../utilities/create_case_namelist.py", line 812, in main
    clubb_input_namelist = create_case_namelist_file(
  File "/home/jenkins/workspace/run_bindiff_w_varying_flags_against_master/bindiff_against_master/master/clubb/run_scripts/../utilities/create_case_namelist.py", line 465, in create_case_namelist_file
    clubb_in = apply_namelist_overrides(args, clubb_in, model_file, output_dir_abs)
  File "/home/jenkins/workspace/run_bindiff_w_varying_flags_against_master/bindiff_against_master/master/clubb/run_scripts/../utilities/create_case_namelist.py", line 356, in apply_namelist_overrides
    clubb_in = override_value(args.override, clubb_in)
  File "/home/jenkins/workspace/run_bindiff_w_varying_flags_against_master/bindiff_against_master/master/clubb/run_scripts/../utilities/create_case_namelist.py", line 251, in override_value
    raise ValueError(
ValueError: Override setting 'l_rtm_nudge' is not present in the selected namelists
Output directory: /home/jenkins/workspace/run_bindiff_w_varying_flags_against_master/bindiff_against_master/master/clubb/output/flag18
--------------------------------------------------
run_scm.py total runtime: 0.11 s
--------------------------------------------------
create_case_namelist failed (exit 1). Command was:
  /usr/bin/python3 /home/jenkins/workspace/run_bindiff_w_varying_flags_against_master/bindiff_against_master/master/clubb/run_scripts/../utilities/create_case_namelist.py -out_dir /home/jenkins/workspace/run_bindiff_w_varying_flags_against_master/bindiff_against_master/master/clubb/output/flag18 -debug 0 -max_iters 360 -override ipdf_call_placement=3,l_rtm_nudge=.true. nov11_altocu

ERROR -- flag18 / rico
Traceback (most recent call last):
  File "/home/jenkins/workspace/run_bindiff_w_varying_flags_against_master/bindiff_against_master/master/clubb/run_scripts/../utilities/create_case_namelist.py", line 841, in <module>
    main()
  File "/home/jenkins/workspace/run_bindiff_w_varying_flags_against_master/bindiff_against_master/master/clubb/run_scripts/../utilities/create_case_namelist.py", line 812, in main
    clubb_input_namelist = create_case_namelist_file(
  File "/home/jenkins/workspace/run_bindiff_w_varying_flags_against_master/bindiff_against_master/master/clubb/run_scripts/../utilities/create_case_namelist.py", line 465, in create_case_namelist_file
    clubb_in = apply_namelist_overrides(args, clubb_in, model_file, output_dir_abs)
  File "/home/jenkins/workspace/run_bindiff_w_varying_flags_against_master/bindiff_against_master/master/clubb/run_scripts/../utilities/create_case_namelist.py", line 356, in apply_namelist_overrides
    clubb_in = override_value(args.override, clubb_in)
  File "/home/jenkins/workspace/run_bindiff_w_varying_flags_against_master/bindiff_against_master/master/clubb/run_scripts/../utilities/create_case_namelist.py", line 251, in override_value
    raise ValueError(
ValueError: Override setting 'l_rtm_nudge' is not present in the selected namelists
Output directory: /home/jenkins/workspace/run_bindiff_w_varying_flags_against_master/bindiff_against_master/master/clubb/output/flag18
--------------------------------------------------
run_scm.py total runtime: 0.12 s
--------------------------------------------------
create_case_namelist failed (exit 1). Command was:
  /usr/bin/python3 /home/jenkins/workspace/run_bindiff_w_varying_flags_against_master/bindiff_against_master/master/clubb/run_scripts/../utilities/create_case_namelist.py -out_dir /home/jenkins/workspace/run_bindiff_w_varying_flags_against_master/bindiff_against_master/master/clubb/output/flag18 -debug 0 -max_iters 360 -override ipdf_call_placement=3,l_rtm_nudge=.true. rico

ERROR -- flag18 / rico_silhs
Traceback (most recent call last):
  File "/home/jenkins/workspace/run_bindiff_w_varying_flags_against_master/bindiff_against_master/master/clubb/run_scripts/../utilities/create_case_namelist.py", line 841, in <module>
    main()
  File "/home/jenkins/workspace/run_bindiff_w_varying_flags_against_master/bindiff_against_master/master/clubb/run_scripts/../utilities/create_case_namelist.py", line 812, in main
    clubb_input_namelist = create_case_namelist_file(
  File "/home/jenkins/workspace/run_bindiff_w_varying_flags_against_master/bindiff_against_master/master/clubb/run_scripts/../utilities/create_case_namelist.py", line 465, in create_case_namelist_file
    clubb_in = apply_namelist_overrides(args, clubb_in, model_file, output_dir_abs)
  File "/home/jenkins/workspace/run_bindiff_w_varying_flags_against_master/bindiff_against_master/master/clubb/run_scripts/../utilities/create_case_namelist.py", line 356, in apply_namelist_overrides
    clubb_in = override_value(args.override, clubb_in)
  File "/home/jenkins/workspace/run_bindiff_w_varying_flags_against_master/bindiff_against_master/master/clubb/run_scripts/../utilities/create_case_namelist.py", line 251, in override_value
    raise ValueError(
ValueError: Override setting 'l_rtm_nudge' is not present in the selected namelists
Output directory: /home/jenkins/workspace/run_bindiff_w_varying_flags_against_master/bindiff_against_master/master/clubb/output/flag18
--------------------------------------------------
run_scm.py total runtime: 0.12 s
--------------------------------------------------
create_case_namelist failed (exit 1). Command was:
  /usr/bin/python3 /home/jenkins/workspace/run_bindiff_w_varying_flags_against_master/bindiff_against_master/master/clubb/run_scripts/../utilities/create_case_namelist.py -out_dir /home/jenkins/workspace/run_bindiff_w_varying_flags_against_master/bindiff_against_master/master/clubb/output/flag18 -debug 0 -max_iters 360 -override ipdf_call_placement=3,l_rtm_nudge=.true. rico_silhs

ERROR -- flag18 / twp_ice
Traceback (most recent call last):
  File "/home/jenkins/workspace/run_bindiff_w_varying_flags_against_master/bindiff_against_master/master/clubb/run_scripts/../utilities/create_case_namelist.py", line 841, in <module>
    main()
  File "/home/jenkins/workspace/run_bindiff_w_varying_flags_against_master/bindiff_against_master/master/clubb/run_scripts/../utilities/create_case_namelist.py", line 812, in main
    clubb_input_namelist = create_case_namelist_file(
  File "/home/jenkins/workspace/run_bindiff_w_varying_flags_against_master/bindiff_against_master/master/clubb/run_scripts/../utilities/create_case_namelist.py", line 465, in create_case_namelist_file
    clubb_in = apply_namelist_overrides(args, clubb_in, model_file, output_dir_abs)
  File "/home/jenkins/workspace/run_bindiff_w_varying_flags_against_master/bindiff_against_master/master/clubb/run_scripts/../utilities/create_case_namelist.py", line 356, in apply_namelist_overrides
    clubb_in = override_value(args.override, clubb_in)
  File "/home/jenkins/workspace/run_bindiff_w_varying_flags_against_master/bindiff_against_master/master/clubb/run_scripts/../utilities/create_case_namelist.py", line 251, in override_value
    raise ValueError(
ValueError: Override setting 'l_rtm_nudge' is not present in the selected namelists
Output directory: /home/jenkins/workspace/run_bindiff_w_varying_flags_against_master/bindiff_against_master/master/clubb/output/flag18
--------------------------------------------------
run_scm.py total runtime: 0.10 s
--------------------------------------------------
create_case_namelist failed (exit 1). Command was:
  /usr/bin/python3 /home/jenkins/workspace/run_bindiff_w_varying_flags_against_master/bindiff_against_master/master/clubb/run_scripts/../utilities/create_case_namelist.py -out_dir /home/jenkins/workspace/run_bindiff_w_varying_flags_against_master/bindiff_against_master/master/clubb/output/flag18 -debug 0 -max_iters 360 -override ipdf_call_placement=3,l_rtm_nudge=.true. twp_ice

ERROR -- flag18 / wangara
Traceback (most recent call last):
  File "/home/jenkins/workspace/run_bindiff_w_varying_flags_against_master/bindiff_against_master/master/clubb/run_scripts/../utilities/create_case_namelist.py", line 841, in <module>
    main()
  File "/home/jenkins/workspace/run_bindiff_w_varying_flags_against_master/bindiff_against_master/master/clubb/run_scripts/../utilities/create_case_namelist.py", line 812, in main
    clubb_input_namelist = create_case_namelist_file(
  File "/home/jenkins/workspace/run_bindiff_w_varying_flags_against_master/bindiff_against_master/master/clubb/run_scripts/../utilities/create_case_namelist.py", line 465, in create_case_namelist_file
    clubb_in = apply_namelist_overrides(args, clubb_in, model_file, output_dir_abs)
  File "/home/jenkins/workspace/run_bindiff_w_varying_flags_against_master/bindiff_against_master/master/clubb/run_scripts/../utilities/create_case_namelist.py", line 356, in apply_namelist_overrides
    clubb_in = override_value(args.override, clubb_in)
  File "/home/jenkins/workspace/run_bindiff_w_varying_flags_against_master/bindiff_against_master/master/clubb/run_scripts/../utilities/create_case_namelist.py", line 251, in override_value
    raise ValueError(
ValueError: Override setting 'l_rtm_nudge' is not present in the selected namelists
Output directory: /home/jenkins/workspace/run_bindiff_w_varying_flags_against_master/bindiff_against_master/master/clubb/output/flag18
--------------------------------------------------
run_scm.py total runtime: 0.11 s
--------------------------------------------------
create_case_namelist failed (exit 1). Command was:
  /usr/bin/python3 /home/jenkins/workspace/run_bindiff_w_varying_flags_against_master/bindiff_against_master/master/clubb/run_scripts/../utilities/create_case_namelist.py -out_dir /home/jenkins/workspace/run_bindiff_w_varying_flags_against_master/bindiff_against_master/master/clubb/output/flag18 -debug 0 -max_iters 360 -override ipdf_call_placement=3,l_rtm_nudge=.true. wangara

COMPLETE -- flag18 / cgils_s12
COMPLETE -- flag17 / twp_ice
COMPLETE -- flag17 / lba

=================== Runs Complete ===================
flag11 failures: arm_97
flag13 failures: arm, arm_97, astex_a209, atex, bomex, cgils_s11, cgils_s12, cgils_s6, clex9_nov02, clex9_oct14, dycoms2_rf01, dycoms2_rf01_fixed_sst, dycoms2_rf02_do, dycoms2_rf02_ds, dycoms2_rf02_nd, dycoms2_rf02_so, fire, gabls2, gabls3, gabls3_night, jun25_altocu, lba, mc3e, mpace_a, mpace_b, mpace_b_silhs, nov11_altocu, rico, rico_silhs, twp_ice, wangara
flag18 failures: arm, arm_97, astex_a209, atex, bomex, cgils_s11, cgils_s6, clex9_nov02, clex9_oct14, dycoms2_rf01, dycoms2_rf01_fixed_sst, dycoms2_rf02_do, dycoms2_rf02_ds, dycoms2_rf02_nd, dycoms2_rf02_so, fire, gabls2, gabls3, gabls3_night, jun25_altocu, lba, mc3e, mpace_a, mpace_b, mpace_b_silhs, nov11_altocu, rico, rico_silhs, twp_ice, wangara

Some CLUBB runs failed. See messages above.
Cloning into '/home/jenkins/workspace/run_bindiff_w_varying_flags_against_master/bindiff_against_master/origin_readiopdata_merge2/clubb'...
Note: switching to 'origin/readiopdata_merge2'.

You are in 'detached HEAD' state. You can look around, make experimental
changes and commit them, and you can discard any commits you make in this
state without impacting any branches by switching back to a branch.

If you want to create a new branch to retain commits you create, you may
do so (now or later) by using -c with the switch command. Example:

  git switch -c <new-branch-name>

Or undo this operation with:

  git switch -

Turn off this advice by setting config variable advice.detachedHead to false

HEAD is now at b306d548f Changes to prepare for merge into master
-- The Fortran compiler identification is GNU 13.1.0
-- The C compiler identification is GNU 13.1.0
-- The CXX compiler identification is GNU 13.1.0
-- Detecting Fortran compiler ABI info
-- Detecting Fortran compiler ABI info - done
-- Check for working Fortran compiler: /usr/local/spack/opt/spack/linux-pop22-cascadelake/gcc-12.2.0/gcc-13.1.0-uswx4gd4eee2bf3orriqppfr4j25x4li/bin/gfortran - skipped
-- Detecting C compiler ABI info
-- Detecting C compiler ABI info - done
-- Check for working C compiler: /usr/local/spack/opt/spack/linux-pop22-cascadelake/gcc-12.2.0/gcc-13.1.0-uswx4gd4eee2bf3orriqppfr4j25x4li/bin/gcc - skipped
-- Detecting C compile features
-- Detecting C compile features - done
-- Detecting CXX compiler ABI info
-- Detecting CXX compiler ABI info - done
-- Check for working CXX compiler: /usr/local/spack/opt/spack/linux-pop22-cascadelake/gcc-12.2.0/gcc-13.1.0-uswx4gd4eee2bf3orriqppfr4j25x4li/bin/g++ - skipped
-- Detecting CXX compile features
-- Detecting CXX compile features - done
-- Compiling with double precision
-- Performing Test NETCDF_ABI_COMPATIBLE
-- Performing Test NETCDF_ABI_COMPATIBLE - Success
-- SUCCESS: netcdf-fortran found.
--   -> Library : /usr/local/spack/opt/spack/linux-pop22-cascadelake/gcc-13.1.0/netcdf-fortran-4.5.3-ivafocv4fav4rj3ckswo6vj33utvtdir/lib/libnetcdff.so
--   -> Modules : /usr/local/spack/opt/spack/linux-pop22-cascadelake/gcc-13.1.0/netcdf-fortran-4.5.3-ivafocv4fav4rj3ckswo6vj33utvtdir/include
-- Configuring done
-- Generating done
-- Build files have been written to: /home/jenkins/workspace/run_bindiff_w_varying_flags_against_master/bindiff_against_master/origin_readiopdata_merge2/clubb/build/gcc_PRECdouble
Using inferred toolchain file: /home/jenkins/workspace/run_bindiff_w_varying_flags_against_master/bindiff_against_master/origin_readiopdata_merge2/clubb/cmake/toolchains/linux_x86_64_gcc.cmake
Setting CLUBB installation dir: /home/jenkins/workspace/run_bindiff_w_varying_flags_against_master/bindiff_against_master/origin_readiopdata_merge2/clubb/build/gcc_PRECdouble
Setting CLUBB installation dir: /home/jenkins/workspace/run_bindiff_w_varying_flags_against_master/bindiff_against_master/origin_readiopdata_merge2/clubb/install/gcc_PRECdouble
about to cmnake /home/jenkins/workspace/run_bindiff_w_varying_flags_against_master/bindiff_against_master/origin_readiopdata_merge2/clubb/build/gcc_PRECdouble
Running CMake configure...
[1/927] Building Fortran preprocessed src/CMakeFiles/clubb_tuner.dir/clubb_tuner.F90-pp.f90
[2/927] Building Fortran preprocessed src/Radiation/CMakeFiles/radiation_lib.dir/bugsrad_driver.F90-pp.f90
[3/927] Building Fortran preprocessed src/Microphys/COAMPS_microphys/CMakeFiles/coamps_lib.dir/eqa12g.F-pp.f
[4/927] Building Fortran preprocessed src/Radiation/BUGSrad/CMakeFiles/bugsrad_lib.dir/cloudg.F-pp.f
[5/927] Building Fortran preprocessed src/CMakeFiles/text_writer_lib.dir/text_writer.F90-pp.f90
[6/927] Building Fortran preprocessed src/CMakeFiles/clubb_thread_test.dir/clubb_thread_test.F90-pp.f90
[7/927] Building Fortran preprocessed src/CMakeFiles/clubb_standalone_loss.dir/clubb_standalone_loss.F90-pp.f90
[8/927] Building Fortran preprocessed src/CMakeFiles/clubb_driver_lib.dir/clubb_loss_driver.F90-pp.f90
[9/927] Building Fortran preprocessed src/CMakeFiles/clubb_standalone.dir/clubb_standalone.F90-pp.f90
[10/927] Building Fortran preprocessed src/CMakeFiles/clubb_loss_driver_test.dir/clubb_loss_driver_test.F90-pp.f90
[11/927] Building Fortran preprocessed src/Radiation/CMakeFiles/radiation_lib.dir/soil_vegetation.F90-pp.f90
[12/927] Building Fortran preprocessed src/Radiation/CMakeFiles/radiation_lib.dir/rad_lwsw_module.F90-pp.f90
[13/927] Building Fortran preprocessed src/Radiation/BUGSrad/CMakeFiles/bugsrad_lib.dir/bugs_rad.F-pp.f
[14/927] Building Fortran preprocessed src/CMakeFiles/clubb_driver_lib.dir/generalized_grid_test.F90-pp.f90
[15/927] Building Fortran preprocessed src/CMakeFiles/clubb_tuner.dir/error.F90-pp.f90
[16/927] Building Fortran preprocessed src/Radiation/CMakeFiles/radiation_lib.dir/parameters_radiation.F90-pp.f90
[17/927] Building Fortran preprocessed src/Radiation/CMakeFiles/radiation_lib.dir/radiation_variables_module.F90-pp.f90
[18/927] Building Fortran preprocessed src/Radiation/CMakeFiles/radiation_lib.dir/radiation_module.F90-pp.f90
[19/927] Building Fortran preprocessed src/Radiation/CMakeFiles/radiation_lib.dir/simple_rad_module.F90-pp.f90
[20/927] Building Fortran preprocessed src/Radiation/BUGSrad/CMakeFiles/bugsrad_lib.dir/bugs_lwr.F-pp.f
[21/927] Building Fortran preprocessed src/Radiation/BUGSrad/CMakeFiles/bugsrad_lib.dir/cloud_correlate.F90-pp.f90
[22/927] Building Fortran preprocessed src/CMakeFiles/clubb_driver_test.dir/clubb_driver_test.F90-pp.f90
[23/927] Building Fortran preprocessed src/Radiation/CMakeFiles/radiation_lib.dir/cos_solar_zen_module.F90-pp.f90
[24/927] Building Fortran preprocessed src/Radiation/CMakeFiles/radiation_lib.dir/extended_atmosphere_module.F90-pp.f90
[25/927] Building Fortran preprocessed src/Radiation/BUGSrad/CMakeFiles/bugsrad_lib.dir/bugsrad_physconst.F90-pp.f90
[26/927] Building Fortran preprocessed src/Radiation/BUGSrad/CMakeFiles/bugsrad_lib.dir/bugsrad_planck.F90-pp.f90
[27/927] Building Fortran preprocessed src/Radiation/BUGSrad/CMakeFiles/bugsrad_lib.dir/bugs_swr.F-pp.f
[28/927] Building Fortran preprocessed src/Radiation/BUGSrad/CMakeFiles/bugsrad_lib.dir/gascon.F-pp.f
[29/927] Building Fortran preprocessed src/CMakeFiles/G_unit_tests.dir/G_unit_tests.F90-pp.f90
[30/927] Building Fortran preprocessed src/Radiation/BUGSrad/CMakeFiles/bugsrad_lib.dir/comscp1.F-pp.f
[31/927] Building Fortran preprocessed src/Radiation/BUGSrad/CMakeFiles/bugsrad_lib.dir/comscp2.F-pp.f
[32/927] Building Fortran preprocessed src/CMakeFiles/clubb_driver_lib.dir/clubb_driver.F90-pp.f90
[33/927] Building Fortran preprocessed src/Radiation/BUGSrad/CMakeFiles/bugsrad_lib.dir/gases_ckd.F90-pp.f90
[34/927] Building Fortran preprocessed src/Radiation/BUGSrad/CMakeFiles/bugsrad_lib.dir/kinds.F90-pp.f90
[35/927] Building Fortran preprocessed src/Radiation/BUGSrad/CMakeFiles/bugsrad_lib.dir/rayle.F-pp.f
[36/927] Building Fortran preprocessed src/Radiation/BUGSrad/CMakeFiles/bugsrad_lib.dir/two_rt_lw_iter.F-pp.f
[37/927] Building Fortran preprocessed src/Radiation/BUGSrad/CMakeFiles/bugsrad_lib.dir/newexp.F90-pp.f90
[38/927] Building Fortran preprocessed src/Radiation/BUGSrad/CMakeFiles/bugsrad_lib.dir/two_rt_lw.F-pp.f
[39/927] Building Fortran preprocessed src/Radiation/BUGSrad/CMakeFiles/bugsrad_lib.dir/two_rt_lw_ocastrndm.F90-pp.f90
[40/927] Building Fortran preprocessed src/Radiation/BUGSrad/CMakeFiles/bugsrad_lib.dir/two_rt_lw_sel.F-pp.f
[41/927] Building Fortran preprocessed src/Radiation/BUGSrad/CMakeFiles/bugsrad_lib.dir/two_rt_sw_iter.F-pp.f
[42/927] Building Fortran preprocessed src/Radiation/BUGSrad/CMakeFiles/bugsrad_lib.dir/two_rt_sw_bs.F-pp.f
[43/927] Building Fortran preprocessed src/Radiation/BUGSrad/CMakeFiles/bugsrad_lib.dir/two_rt_sw.F-pp.f
[44/927] Building Fortran preprocessed src/Radiation/BUGSrad/CMakeFiles/bugsrad_lib.dir/two_rt_sw_ocastrndm.F90-pp.f90
[45/927] Building Fortran preprocessed src/Microphys/CMakeFiles/microphys_lib.dir/cloud_sed_module.F90-pp.f90
[46/927] Building Fortran preprocessed src/Microphys/CMakeFiles/microphys_lib.dir/lh_microphys_driver_module.F90-pp.f90
[47/927] Building Fortran preprocessed src/Microphys/CMakeFiles/microphys_lib.dir/advance_microphys_module.F90-pp.f90
[48/927] Building Fortran preprocessed src/Microphys/CMakeFiles/microphys_lib.dir/microphys_driver.F90-pp.f90
[49/927] Building Fortran preprocessed src/Microphys/CMakeFiles/microphys_lib.dir/microphys_init_cleanup.F90-pp.f90
[50/927] Building Fortran preprocessed src/Microphys/CMakeFiles/microphys_lib.dir/parameters_microphys.F90-pp.f90
[51/927] Building Fortran preprocessed src/Microphys/CMakeFiles/microphys_lib.dir/gfdl_activation.F90-pp.f90
[52/927] Building Fortran preprocessed src/Microphys/CMakeFiles/microphys_lib.dir/coamps_microphys_driver_module.F90-pp.f90
[53/927] Building Fortran preprocessed src/Microphys/CMakeFiles/microphys_lib.dir/morrison_microphys_module.F90-pp.f90
[54/927] Building Fortran preprocessed src/Microphys/CMakeFiles/microphys_lib.dir/KK_microphys_module.F90-pp.f90
[55/927] Building Fortran preprocessed src/Microphys/CMakeFiles/microphys_lib.dir/estimate_scm_microphys_module.F90-pp.f90
[56/927] Building Fortran preprocessed src/Microphys/CMakeFiles/microphys_lib.dir/ice_dfsn_module.F90-pp.f90
[57/927] Building Fortran preprocessed src/Microphys/CMakeFiles/microphys_lib.dir/pdf_hydromet_microphys_wrapper.F90-pp.f90
[58/927] Building Fortran preprocessed src/Microphys/KK_microphys/CMakeFiles/KK_microphys_lib.dir/KK_Nrm_tendencies.F90-pp.f90
[59/927] Building Fortran preprocessed src/Microphys/CMakeFiles/microphys_lib.dir/silhs_category_variance_module.F90-pp.f90
[60/927] Building Fortran preprocessed src/Microphys/CMakeFiles/microphys_lib.dir/mixed_moment_PDF_integrals.F90-pp.f90
[61/927] Building Fortran preprocessed src/Microphys/KK_microphys/CMakeFiles/KK_microphys_lib.dir/KK_utilities.F90-pp.f90
[62/927] Building Fortran preprocessed src/Microphys/KK_microphys/CMakeFiles/KK_microphys_lib.dir/KK_local_means.F90-pp.f90
[63/927] Building Fortran preprocessed src/Microphys/KK_microphys/CMakeFiles/KK_microphys_lib.dir/KK_upscaled_means.F90-pp.f90
[64/927] Building Fortran preprocessed src/Microphys/KK_microphys/CMakeFiles/KK_microphys_lib.dir/KK_upscaled_turbulent_sed.F90-pp.f90
[65/927] Building Fortran preprocessed src/Microphys/KK_microphys/CMakeFiles/KK_microphys_lib.dir/KK_upscaled_variances.F90-pp.f90
[66/927] Building Fortran preprocessed src/Microphys/KK_microphys/CMakeFiles/KK_microphys_lib.dir/parameters_KK.F90-pp.f90
[67/927] Building Fortran preprocessed src/Microphys/KK_microphys/CMakeFiles/KK_microphys_lib.dir/KK_upscaled_covariances.F90-pp.f90
[68/927] Building Fortran preprocessed src/Microphys/KK_microphys/CMakeFiles/KK_microphys_lib.dir/PDF_integrals_means.F90-pp.f90
[69/927] Building Fortran preprocessed src/Microphys/KK_microphys/CMakeFiles/KK_microphys_lib.dir/PDF_integrals_covar.F90-pp.f90
[70/927] Building Fortran preprocessed src/Microphys/KK_microphys/CMakeFiles/KK_microphys_lib.dir/PDF_integrals_all_MM.F90-pp.f90
[71/927] Building Fortran preprocessed src/Microphys/KK_microphys/CMakeFiles/KK_microphys_lib.dir/Parabolic_constants.f90-pp.f90
[72/927] Building Fortran preprocessed src/Microphys/COAMPS_microphys/CMakeFiles/coamps_lib.dir/adjmlt.F-pp.f
[73/927] Building Fortran preprocessed src/Microphys/COAMPS_microphys/CMakeFiles/coamps_lib.dir/conice.F-pp.f
[74/927] Building Fortran preprocessed src/Microphys/COAMPS_microphys/CMakeFiles/coamps_lib.dir/eqa11g.F-pp.f
[75/927] Building Fortran preprocessed src/Microphys/KK_microphys/CMakeFiles/KK_microphys_lib.dir/AiryFunction.f90-pp.f90
[76/927] Building Fortran preprocessed src/Microphys/COAMPS_microphys/CMakeFiles/coamps_lib.dir/eqa10g.F-pp.f
[77/927] Building Fortran preprocessed src/Microphys/COAMPS_microphys/CMakeFiles/coamps_lib.dir/eqa15.F-pp.f
[78/927] Building Fortran preprocessed src/Microphys/KK_microphys/CMakeFiles/KK_microphys_lib.dir/Parabolic.f90-pp.f90
[79/927] Building Fortran preprocessed src/Microphys/COAMPS_microphys/CMakeFiles/coamps_lib.dir/eqa12.F-pp.f
[80/927] Building Fortran preprocessed src/CLUBB_core/CMakeFiles/clubb_core_lib.dir/model_flags.F90-pp.f90
[81/927] Building Fortran preprocessed src/Microphys/COAMPS_microphys/CMakeFiles/coamps_lib.dir/eqa13g.F-pp.f
[82/927] Building Fortran preprocessed src/Microphys/COAMPS_microphys/CMakeFiles/coamps_lib.dir/adjtq.F-pp.f
[83/927] Building Fortran preprocessed src/Microphys/COAMPS_microphys/CMakeFiles/coamps_lib.dir/eqa14g.F-pp.f
[84/927] Building Fortran preprocessed src/Microphys/COAMPS_microphys/CMakeFiles/coamps_lib.dir/eqa18.F-pp.f
[85/927] Building Fortran preprocessed src/Microphys/COAMPS_microphys/CMakeFiles/coamps_lib.dir/eqa19.F-pp.f
[86/927] Building Fortran preprocessed src/Microphys/COAMPS_microphys/CMakeFiles/coamps_lib.dir/eqa17g.F-pp.f
[87/927] Building Fortran preprocessed src/Microphys/COAMPS_microphys/CMakeFiles/coamps_lib.dir/eqa19g.F-pp.f
[88/927] Building Fortran preprocessed src/Microphys/COAMPS_microphys/CMakeFiles/coamps_lib.dir/eqa20g.F-pp.f
[89/927] Building Fortran preprocessed src/Microphys/COAMPS_microphys/CMakeFiles/coamps_lib.dir/eqa21.F-pp.f
[90/927] Building Fortran preprocessed src/Microphys/COAMPS_microphys/CMakeFiles/coamps_lib.dir/eqa22g.F-pp.f
[91/927] Building Fortran preprocessed src/Microphys/COAMPS_microphys/CMakeFiles/coamps_lib.dir/eqa21g.F-pp.f
[92/927] Building Fortran preprocessed src/Microphys/COAMPS_microphys/CMakeFiles/coamps_lib.dir/eqa22.F-pp.f
[93/927] Building Fortran preprocessed src/Microphys/COAMPS_microphys/CMakeFiles/coamps_lib.dir/eqa18g.F-pp.f
[94/927] Building Fortran preprocessed src/Microphys/COAMPS_microphys/CMakeFiles/coamps_lib.dir/eqa25.F-pp.f
[95/927] Building Fortran preprocessed src/Microphys/COAMPS_microphys/CMakeFiles/coamps_lib.dir/eqa26.F-pp.f
[96/927] Building Fortran preprocessed src/Microphys/COAMPS_microphys/CMakeFiles/coamps_lib.dir/eqa27.F-pp.f
[97/927] Building Fortran preprocessed src/Microphys/COAMPS_microphys/CMakeFiles/coamps_lib.dir/eqa27r.F-pp.f
[98/927] Building Fortran preprocessed src/Microphys/COAMPS_microphys/CMakeFiles/coamps_lib.dir/eqa28.F-pp.f
[99/927] Building Fortran preprocessed src/Microphys/COAMPS_microphys/CMakeFiles/coamps_lib.dir/eqa5g.F-pp.f
[100/927] Building Fortran preprocessed src/Microphys/COAMPS_microphys/CMakeFiles/coamps_lib.dir/eqa6.F-pp.f
[101/927] Building Fortran preprocessed src/Microphys/COAMPS_microphys/CMakeFiles/coamps_lib.dir/eqa7g.F-pp.f
[102/927] Building Fortran preprocessed src/Microphys/COAMPS_microphys/CMakeFiles/coamps_lib.dir/eqa7.F-pp.f
[103/927] Building Fortran preprocessed src/Microphys/COAMPS_microphys/CMakeFiles/coamps_lib.dir/eqa8g.F-pp.f
[104/927] Building Fortran preprocessed src/Microphys/COAMPS_microphys/CMakeFiles/coamps_lib.dir/eqa9.F-pp.f
[105/927] Building Fortran preprocessed src/Microphys/COAMPS_microphys/CMakeFiles/coamps_lib.dir/eqa9g.F-pp.f
[106/927] Building Fortran preprocessed src/Microphys/COAMPS_microphys/CMakeFiles/coamps_lib.dir/frzh.F-pp.f
[107/927] Building Fortran preprocessed src/Microphys/COAMPS_microphys/CMakeFiles/coamps_lib.dir/esati.F-pp.f
[108/927] Building Fortran preprocessed src/Microphys/COAMPS_microphys/CMakeFiles/coamps_lib.dir/nrmcol.F-pp.f
[109/927] Building Fortran preprocessed src/Microphys/COAMPS_microphys/CMakeFiles/coamps_lib.dir/esatv.F-pp.f
[110/927] Building Fortran preprocessed src/Microphys/COAMPS_microphys/CMakeFiles/coamps_lib.dir/gamma.F-pp.f
[111/927] Building Fortran preprocessed src/Microphys/COAMPS_microphys/CMakeFiles/coamps_lib.dir/esat_new.F-pp.f
[112/927] Building Fortran preprocessed src/Microphys/COAMPS_microphys/CMakeFiles/coamps_lib.dir/nrmtqw.F-pp.f
[113/927] Building Fortran preprocessed src/Microphys/COAMPS_microphys/CMakeFiles/coamps_lib.dir/qsatvi.F-pp.f
[114/927] Building Fortran preprocessed src/Microphys/COAMPS_microphys/CMakeFiles/coamps_lib.dir/qtadj.F-pp.f
[115/927] Building Fortran preprocessed src/Microphys/COAMPS_microphys/CMakeFiles/coamps_lib.dir/slope.F-pp.f
[116/927] Building Fortran preprocessed src/Microphys/COAMPS_microphys/CMakeFiles/coamps_lib.dir/nrmtqi.F-pp.f
[117/927] Building Fortran preprocessed src/Microphys/COAMPS_microphys/CMakeFiles/coamps_lib.dir/tgqg.F-pp.f
[118/927] Building Fortran preprocessed src/Microphys/COAMPS_microphys/CMakeFiles/coamps_lib.dir/tgqr.F-pp.f
[119/927] Building Fortran preprocessed src/Microphys/COAMPS_microphys/CMakeFiles/coamps_lib.dir/tgqs.F-pp.f
[120/927] Building Fortran preprocessed src/Microphys/COAMPS_microphys/CMakeFiles/coamps_lib.dir/tgqi.F-pp.f
[121/927] Building Fortran preprocessed src/Microphys/Microphys_utils/CMakeFiles/microphys_utils_lib.dir/microphys_stats_vars_module.F90-pp.f90
[122/927] Building Fortran preprocessed src/SILHS/CMakeFiles/silhs_lib.dir/est_kessler_microphys_module.F90-pp.f90
[123/927] Building Fortran preprocessed src/SILHS/CMakeFiles/silhs_lib.dir/lh_microphys_var_covar_module.F90-pp.f90
[124/927] Building Fortran preprocessed src/Microphys/SCM_Activation/CMakeFiles/scm_activation_lib.dir/aer_ccn_act_k.F90-pp.f90
[125/927] Building Fortran preprocessed src/SILHS/CMakeFiles/silhs_lib.dir/latin_hypercube_arrays.F90-pp.f90
[126/927] Building Fortran preprocessed src/SILHS/CMakeFiles/silhs_lib.dir/generate_uniform_sample_module.F90-pp.f90
[127/927] Building Fortran preprocessed src/SILHS/CMakeFiles/silhs_lib.dir/latin_hypercube_driver_module.F90-pp.f90
[128/927] Building Fortran preprocessed src/Microphys/Morrison_microphys/CMakeFiles/morrison_microphys_lib.dir/module_mp_graupel.F90-pp.f90
[129/927] Building Fortran preprocessed src/SILHS/CMakeFiles/silhs_lib.dir/parameters_silhs.F90-pp.f90
[130/927] Building Fortran preprocessed src/SILHS/CMakeFiles/silhs_lib.dir/math_utilities.F90-pp.f90
[131/927] Building Fortran preprocessed src/SILHS/CMakeFiles/silhs_lib.dir/transform_to_pdf_module.F90-pp.f90
[132/927] Building Fortran preprocessed src/SILHS/CMakeFiles/silhs_lib.dir/mt95.F90-pp.f90
[133/927] Building Fortran preprocessed src/SILHS/CMakeFiles/silhs_lib.dir/silhs_api_module.F90-pp.f90
[134/927] Building Fortran preprocessed src/Numerical_recipes/CMakeFiles/numerical_recipes_lib.dir/amebsa.f90-pp.f90
[135/927] Generating Fortran dyndep file src/Microphys/SCM_Activation/CMakeFiles/scm_activation_lib.dir/Fortran.dd
[136/927] Building Fortran preprocessed src/SILHS/CMakeFiles/silhs_lib.dir/silhs_importance_sample_module.F90-pp.f90
[137/927] Building Fortran preprocessed src/Lapack/Lapack_double/CMakeFiles/clubb_lapack_double.dir/dlarfb.f-pp.f
[138/927] Building Fortran preprocessed src/Numerical_recipes/CMakeFiles/numerical_recipes_lib.dir/amoeba.f90-pp.f90
[139/927] Building Fortran preprocessed src/Numerical_recipes/CMakeFiles/numerical_recipes_lib.dir/nrtype.f90-pp.f90
[140/927] Building Fortran preprocessed src/Lapack/Lapack_double/CMakeFiles/clubb_lapack_double.dir/dlarf.f-pp.f
[141/927] Building Fortran preprocessed src/Numerical_recipes/CMakeFiles/numerical_recipes_lib.dir/nr.f90-pp.f90
[142/927] Building Fortran preprocessed src/Numerical_recipes/CMakeFiles/numerical_recipes_lib.dir/nrutil.f90-pp.f90
[143/927] Building Fortran preprocessed src/Numerical_recipes/CMakeFiles/numerical_recipes_lib.dir/ran1_s.f90-pp.f90
[144/927] Building Fortran preprocessed src/Numerical_recipes/CMakeFiles/numerical_recipes_lib.dir/quicksort.F90-pp.f90
[145/927] Building Fortran preprocessed src/G_unit_test_types/CMakeFiles/G_unit_test_lib.dir/KK_integrals_tests.F90-pp.f90
[146/927] Building Fortran preprocessed src/Numerical_recipes/CMakeFiles/numerical_recipes_lib.dir/ran1_v.f90-pp.f90
[147/927] Building Fortran preprocessed src/Numerical_recipes/CMakeFiles/numerical_recipes_lib.dir/enhanced_simann.F90-pp.f90
[148/927] Building Fortran preprocessed src/G_unit_test_types/CMakeFiles/G_unit_test_lib.dir/corr_cholesky_mtx_tests.F90-pp.f90
[149/927] Building Fortran preprocessed src/G_unit_test_types/CMakeFiles/G_unit_test_lib.dir/read_corr_mtx_test.F90-pp.f90
[150/927] Building Fortran preprocessed src/Numerical_recipes/CMakeFiles/numerical_recipes_lib.dir/ran_state.f90-pp.f90
[151/927] Building Fortran preprocessed src/G_unit_test_types/CMakeFiles/G_unit_test_lib.dir/Nc_Ncn_test.F90-pp.f90
[152/927] Building Fortran preprocessed src/G_unit_test_types/CMakeFiles/G_unit_test_lib.dir/silhs_category_test.F90-pp.f90
[153/927] Building Fortran preprocessed src/G_unit_test_types/CMakeFiles/G_unit_test_lib.dir/hole_filling_tests.F90-pp.f90
[154/927] Building Fortran preprocessed src/G_unit_test_types/CMakeFiles/G_unit_test_lib.dir/mu_sigma_hm_tests.F90-pp.f90
[155/927] Building Fortran preprocessed src/G_unit_test_types/CMakeFiles/G_unit_test_lib.dir/spurious_source_test.F90-pp.f90
[156/927] Building Fortran preprocessed src/G_unit_test_types/CMakeFiles/G_unit_test_lib.dir/tuner_tests.F90-pp.f90
[157/927] Building Fortran preprocessed src/G_unit_test_types/CMakeFiles/G_unit_test_lib.dir/pdf_parameter_tests.F90-pp.f90
[158/927] Building Fortran preprocessed src/G_unit_test_types/CMakeFiles/G_unit_test_lib.dir/fill_holes_tests.F90-pp.f90
[159/927] Building Fortran preprocessed src/G_unit_test_types/CMakeFiles/G_unit_test_lib.dir/w_up_in_cloud_tests.F90-pp.f90
[160/927] Building Fortran preprocessed src/G_unit_test_types/CMakeFiles/G_unit_test_lib.dir/smooth_heaviside_tests.F90-pp.f90
[161/927] Building Fortran preprocessed src/CLUBB_core/CMakeFiles/clubb_core_lib.dir/adg1_adg2_3d_luhar_pdf.F90-pp.f90
[162/927] Building Fortran preprocessed src/G_unit_test_types/CMakeFiles/G_unit_test_lib.dir/smooth_min_max_tests.F90-pp.f90
[163/927] Building Fortran preprocessed src/G_unit_test_types/CMakeFiles/G_unit_test_lib.dir/rev_direction_grid_test.F90-pp.f90
[164/927] Building Fortran preprocessed src/CLUBB_core/CMakeFiles/clubb_core_lib.dir/advance_clubb_core_module.F90-pp.f90
[165/927] Building Fortran preprocessed src/CLUBB_core/CMakeFiles/clubb_core_lib.dir/advance_helper_module.F90-pp.f90
[166/927] Building Fortran preprocessed src/CLUBB_core/CMakeFiles/clubb_core_lib.dir/advance_windm_edsclrm_module.F90-pp.f90
[167/927] Building Fortran preprocessed src/CLUBB_core/CMakeFiles/clubb_core_lib.dir/calc_pressure.F90-pp.f90
[168/927] Building Fortran preprocessed src/CLUBB_core/CMakeFiles/clubb_core_lib.dir/calendar.F90-pp.f90
[169/927] Building Fortran preprocessed src/CLUBB_core/CMakeFiles/clubb_core_lib.dir/clip_explicit.F90-pp.f90
[170/927] Building Fortran preprocessed src/CLUBB_core/CMakeFiles/clubb_core_lib.dir/array_index.F90-pp.f90
[171/927] Building Fortran preprocessed src/CLUBB_core/CMakeFiles/clubb_core_lib.dir/clubb_precision.F90-pp.f90
[172/927] Building Fortran preprocessed src/CLUBB_core/CMakeFiles/clubb_core_lib.dir/advance_xp3_module.F90-pp.f90
[173/927] Building Fortran preprocessed src/CLUBB_core/CMakeFiles/clubb_core_lib.dir/calc_roots.F90-pp.f90
[174/927] Building Fortran preprocessed src/CLUBB_core/CMakeFiles/clubb_core_lib.dir/clubb_api_module.F90-pp.f90
[175/927] Building Fortran preprocessed src/CLUBB_core/CMakeFiles/clubb_core_lib.dir/code_timer_module.F90-pp.f90
[176/927] Building Fortran preprocessed src/CLUBB_core/CMakeFiles/clubb_core_lib.dir/constants_clubb.F90-pp.f90
[177/927] Building Fortran preprocessed src/CLUBB_core/CMakeFiles/clubb_core_lib.dir/corr_varnce_module.F90-pp.f90
[178/927] Building Fortran preprocessed src/CLUBB_core/CMakeFiles/clubb_core_lib.dir/diagnose_correlations_module.F90-pp.f90
[179/927] Building Fortran preprocessed src/CLUBB_core/CMakeFiles/clubb_core_lib.dir/advance_wp2_wp3_module.F90-pp.f90
[180/927] Building Fortran preprocessed src/CLUBB_core/CMakeFiles/clubb_core_lib.dir/advance_xm_wpxp_module.F90-pp.f90
[181/927] Building Fortran preprocessed src/CLUBB_core/CMakeFiles/clubb_core_lib.dir/advance_xp2_xpyp_module.F90-pp.f90
[182/927] Building Fortran preprocessed src/CLUBB_core/CMakeFiles/clubb_core_lib.dir/err_info_type_module.F90-pp.f90
[183/927] Building Fortran preprocessed src/CLUBB_core/CMakeFiles/clubb_core_lib.dir/file_functions.F90-pp.f90
[184/927] Building Fortran preprocessed src/CLUBB_core/CMakeFiles/clubb_core_lib.dir/endian.F90-pp.f90
[185/927] Building Fortran preprocessed src/CLUBB_core/CMakeFiles/clubb_core_lib.dir/error_code.F90-pp.f90
[186/927] Building Fortran preprocessed src/CLUBB_core/CMakeFiles/clubb_core_lib.dir/diffusion.F90-pp.f90
[187/927] Building Fortran preprocessed src/CLUBB_core/CMakeFiles/clubb_core_lib.dir/fill_holes.F90-pp.f90
[188/927] Building Fortran preprocessed src/CLUBB_core/CMakeFiles/clubb_core_lib.dir/grid_class.F90-pp.f90
[189/927] Building Fortran preprocessed src/CLUBB_core/CMakeFiles/clubb_core_lib.dir/hydromet_pdf_parameter_module.F90-pp.f90
[190/927] Building Fortran preprocessed src/CLUBB_core/CMakeFiles/clubb_core_lib.dir/index_mapping.F90-pp.f90
[191/927] Building Fortran preprocessed src/CLUBB_core/CMakeFiles/clubb_core_lib.dir/interpolation.F90-pp.f90
[192/927] Building Fortran preprocessed src/CLUBB_core/CMakeFiles/clubb_core_lib.dir/lapack_interfaces.F90-pp.f90
[193/927] Building Fortran preprocessed src/CLUBB_core/CMakeFiles/clubb_core_lib.dir/lapack_wrap.F90-pp.f90
[194/927] Building Fortran preprocessed src/CLUBB_core/CMakeFiles/clubb_core_lib.dir/LY93_pdf.F90-pp.f90
[195/927] Building Fortran preprocessed src/CLUBB_core/CMakeFiles/clubb_core_lib.dir/matrix_operations.F90-pp.f90
[196/927] Building Fortran preprocessed src/CLUBB_core/CMakeFiles/clubb_core_lib.dir/Nc_Ncn_eqns.F90-pp.f90
[197/927] Building Fortran preprocessed src/CLUBB_core/CMakeFiles/clubb_core_lib.dir/new_hybrid_pdf.F90-pp.f90
[198/927] Building Fortran preprocessed src/CLUBB_core/CMakeFiles/clubb_core_lib.dir/mixing_length.F90-pp.f90
[199/927] Building Fortran preprocessed src/CLUBB_core/CMakeFiles/clubb_core_lib.dir/mean_adv.F90-pp.f90
[200/927] Building Fortran preprocessed src/CLUBB_core/CMakeFiles/clubb_core_lib.dir/matrix_solver_wrapper.F90-pp.f90
[201/927] Building Fortran preprocessed src/CLUBB_core/CMakeFiles/clubb_core_lib.dir/new_hybrid_pdf_main.F90-pp.f90
[202/927] Building Fortran preprocessed src/CLUBB_core/CMakeFiles/clubb_core_lib.dir/new_pdf_main.F90-pp.f90
[203/927] Building Fortran preprocessed src/CLUBB_core/CMakeFiles/clubb_core_lib.dir/new_tsdadg_pdf.F90-pp.f90
[204/927] Building Fortran preprocessed src/CLUBB_core/CMakeFiles/clubb_core_lib.dir/new_pdf.F90-pp.f90
[205/927] Building Fortran preprocessed src/CLUBB_core/CMakeFiles/clubb_core_lib.dir/mono_flux_limiter.F90-pp.f90
[206/927] Building Fortran preprocessed src/CLUBB_core/CMakeFiles/clubb_core_lib.dir/parameter_indices.F90-pp.f90
[207/927] Building Fortran preprocessed src/CLUBB_core/CMakeFiles/clubb_core_lib.dir/numerical_check.F90-pp.f90
[208/927] Building Fortran preprocessed src/CLUBB_core/CMakeFiles/clubb_core_lib.dir/stats_netcdf.F90-pp.f90
[209/927] Building Fortran preprocessed src/CLUBB_core/CMakeFiles/clubb_core_lib.dir/penta_lu_solver.F90-pp.f90
[210/927] Building Fortran preprocessed src/CLUBB_core/CMakeFiles/clubb_core_lib.dir/parameters_tunable.F90-pp.f90
[211/927] Building Fortran preprocessed src/CLUBB_core/CMakeFiles/clubb_core_lib.dir/pdf_parameter_module.F90-pp.f90
[212/927] Building Fortran preprocessed src/CLUBB_core/CMakeFiles/clubb_core_lib.dir/pdf_utilities.F90-pp.f90
[213/927] Building Fortran preprocessed src/CLUBB_core/CMakeFiles/clubb_core_lib.dir/pos_definite_module.F90-pp.f90
[214/927] Building Fortran preprocessed src/CLUBB_core/CMakeFiles/clubb_core_lib.dir/precipitation_fraction.F90-pp.f90
[215/927] Building Fortran preprocessed src/CLUBB_core/CMakeFiles/clubb_core_lib.dir/saturation.F90-pp.f90
[216/927] Building Fortran preprocessed src/CLUBB_core/CMakeFiles/clubb_core_lib.dir/penta_bicgstab_solver.F90-pp.f90
[217/927] Building Fortran preprocessed src/CLUBB_core/CMakeFiles/clubb_core_lib.dir/sfc_varnce_module.F90-pp.f90
[218/927] Building Fortran preprocessed src/CLUBB_core/CMakeFiles/clubb_core_lib.dir/pdf_closure_module.F90-pp.f90
[219/927] Building Fortran preprocessed src/CLUBB_core/CMakeFiles/clubb_core_lib.dir/sigma_sqd_w_module.F90-pp.f90
[220/927] Building Fortran preprocessed src/CLUBB_core/CMakeFiles/clubb_core_lib.dir/sponge_layer_damping.F90-pp.f90
[221/927] Building Fortran preprocessed src/CLUBB_core/CMakeFiles/clubb_core_lib.dir/setup_clubb_pdf_params.F90-pp.f90
[222/927] Building Fortran preprocessed src/CLUBB_core/CMakeFiles/clubb_core_lib.dir/Skx_module.F90-pp.f90
[223/927] Building Fortran preprocessed src/CLUBB_core/CMakeFiles/clubb_core_lib.dir/T_in_K_module.F90-pp.f90
[224/927] Building Fortran preprocessed src/CLUBB_core/CMakeFiles/clubb_core_lib.dir/tridiag_lu_solver.F90-pp.f90
[225/927] Building Fortran preprocessed src/CLUBB_core/CMakeFiles/clubb_core_lib.dir/stats_clubb_utilities.F90-pp.f90
[226/927] Building Fortran preprocessed src/CLUBB_core/CMakeFiles/clubb_core_lib.dir/turbulent_adv_pdf.F90-pp.f90
[227/927] Building Fortran preprocessed src/Lapack/Lapack_single/CMakeFiles/clubb_lapack_single.dir/sgbmv.f-pp.f
[228/927] Building Fortran preprocessed src/CLUBB_core/CMakeFiles/clubb_core_lib.dir/remapping_module.F90-pp.f90
[229/927] Building Fortran preprocessed src/Lapack/Lapack_single/CMakeFiles/clubb_lapack_single.dir/ilaslc.f-pp.f
[230/927] Building Fortran preprocessed src/Lapack/Lapack_single/CMakeFiles/clubb_lapack_single.dir/sgbequ.f-pp.f
[231/927] Building Fortran preprocessed src/Lapack/Lapack_single/CMakeFiles/clubb_lapack_single.dir/isamax.f-pp.f
[232/927] Building Fortran preprocessed src/CLUBB_core/CMakeFiles/clubb_core_lib.dir/grid_adaptation_module.F90-pp.f90
[233/927] Building Fortran preprocessed src/Lapack/Lapack_single/CMakeFiles/clubb_lapack_single.dir/sasum.f-pp.f
[234/927] Building Fortran preprocessed src/Lapack/Lapack_single/CMakeFiles/clubb_lapack_single.dir/ilaslr.f-pp.f
[235/927] Building Fortran preprocessed src/Lapack/Lapack_single/CMakeFiles/clubb_lapack_single.dir/scopy.f-pp.f
[236/927] Building Fortran preprocessed src/Lapack/Lapack_single/CMakeFiles/clubb_lapack_single.dir/saxpy.f-pp.f
[237/927] Building Fortran preprocessed src/Lapack/Lapack_single/CMakeFiles/clubb_lapack_single.dir/sgbtf2.f-pp.f
[238/927] Building Fortran preprocessed src/Lapack/Lapack_single/CMakeFiles/clubb_lapack_single.dir/sdot.f-pp.f
[239/927] Building Fortran preprocessed src/Lapack/Lapack_single/CMakeFiles/clubb_lapack_single.dir/sgbcon.f-pp.f
[240/927] Building Fortran preprocessed src/Lapack/Lapack_single/CMakeFiles/clubb_lapack_single.dir/sgbrfs.f-pp.f
[241/927] Building Fortran preprocessed src/Lapack/Lapack_single/CMakeFiles/clubb_lapack_single.dir/sgbsvx.f-pp.f
[242/927] Building Fortran preprocessed src/Lapack/Lapack_single/CMakeFiles/clubb_lapack_single.dir/sgemv.f-pp.f
[243/927] Building Fortran preprocessed src/Lapack/Lapack_single/CMakeFiles/clubb_lapack_single.dir/sgbsv.f-pp.f
[244/927] Building Fortran preprocessed src/Lapack/Lapack_single/CMakeFiles/clubb_lapack_single.dir/sgbtrf.f-pp.f
[245/927] Building Fortran preprocessed src/Lapack/Lapack_single/CMakeFiles/clubb_lapack_single.dir/sgbtrs.f-pp.f
[246/927] Building Fortran preprocessed src/Lapack/Lapack_single/CMakeFiles/clubb_lapack_single.dir/sgemm.f-pp.f
[247/927] Building Fortran preprocessed src/Lapack/Lapack_single/CMakeFiles/clubb_lapack_single.dir/sger.f-pp.f
[248/927] Building Fortran preprocessed src/Lapack/Lapack_single/CMakeFiles/clubb_lapack_single.dir/sgtcon.f-pp.f
[249/927] Building Fortran preprocessed src/Lapack/Lapack_single/CMakeFiles/clubb_lapack_single.dir/sgtrfs.f-pp.f
[250/927] Building Fortran preprocessed src/Lapack/Lapack_single/CMakeFiles/clubb_lapack_single.dir/sgtsv.f-pp.f
[251/927] Building Fortran preprocessed src/Lapack/Lapack_single/CMakeFiles/clubb_lapack_single.dir/sgtsvx.f-pp.f
[252/927] Building Fortran preprocessed src/Lapack/Lapack_single/CMakeFiles/clubb_lapack_single.dir/sgttrs.f-pp.f
[253/927] Building Fortran preprocessed src/Lapack/Lapack_single/CMakeFiles/clubb_lapack_single.dir/sisnan.f-pp.f
[254/927] Building Fortran preprocessed src/Lapack/Lapack_single/CMakeFiles/clubb_lapack_single.dir/sgttrf.f-pp.f
[255/927] Building Fortran preprocessed src/Lapack/Lapack_single/CMakeFiles/clubb_lapack_single.dir/sgtts2.f-pp.f
[256/927] Building Fortran preprocessed src/Lapack/Lapack_single/CMakeFiles/clubb_lapack_single.dir/slacn2.f-pp.f
[257/927] Building Fortran preprocessed src/Lapack/Lapack_single/CMakeFiles/clubb_lapack_single.dir/slabad.f-pp.f
[258/927] Building Fortran preprocessed src/Lapack/Lapack_single/CMakeFiles/clubb_lapack_single.dir/slae2.f-pp.f
[259/927] Building Fortran preprocessed src/Lapack/Lapack_single/CMakeFiles/clubb_lapack_single.dir/slacpy.f-pp.f
[260/927] Building Fortran preprocessed src/Lapack/Lapack_single/CMakeFiles/clubb_lapack_single.dir/slaisnan.f-pp.f
[261/927] Building Fortran preprocessed src/Lapack/Lapack_single/CMakeFiles/clubb_lapack_single.dir/slaev2.f-pp.f
[262/927] Building Fortran preprocessed src/Lapack/Lapack_single/CMakeFiles/clubb_lapack_single.dir/slagtm.f-pp.f
[263/927] Building Fortran preprocessed src/Lapack/Lapack_single/CMakeFiles/clubb_lapack_single.dir/slamch.f-pp.f
[264/927] Building Fortran preprocessed src/Lapack/Lapack_single/CMakeFiles/clubb_lapack_single.dir/slangb.f-pp.f
[265/927] Building Fortran preprocessed src/Lapack/Lapack_single/CMakeFiles/clubb_lapack_single.dir/slangt.f-pp.f
[266/927] Building Fortran preprocessed src/Lapack/Lapack_single/CMakeFiles/clubb_lapack_single.dir/slanst.f-pp.f
[267/927] Building Fortran preprocessed src/Lapack/Lapack_single/CMakeFiles/clubb_lapack_single.dir/slansy.f-pp.f
[268/927] Building Fortran preprocessed src/Lapack/Lapack_single/CMakeFiles/clubb_lapack_single.dir/slapy2.f-pp.f
[269/927] Building Fortran preprocessed src/Lapack/Lapack_single/CMakeFiles/clubb_lapack_single.dir/slantb.f-pp.f
[270/927] Building Fortran preprocessed src/Lapack/Lapack_single/CMakeFiles/clubb_lapack_single.dir/slaqgb.f-pp.f
[271/927] Building Fortran preprocessed src/Lapack/Lapack_single/CMakeFiles/clubb_lapack_single.dir/slaqsy.f-pp.f
[272/927] Building Fortran preprocessed src/Lapack/Lapack_single/CMakeFiles/clubb_lapack_single.dir/slarfb.f-pp.f
[273/927] Building Fortran preprocessed src/Lapack/Lapack_single/CMakeFiles/clubb_lapack_single.dir/slarfg.f-pp.f
[274/927] Building Fortran preprocessed src/Lapack/Lapack_single/CMakeFiles/clubb_lapack_single.dir/slarft.f-pp.f
[275/927] Building Fortran preprocessed src/Lapack/Lapack_single/CMakeFiles/clubb_lapack_single.dir/slartg.f-pp.f
[276/927] Building Fortran preprocessed src/Lapack/Lapack_single/CMakeFiles/clubb_lapack_single.dir/slarf.f-pp.f
[277/927] Building Fortran preprocessed src/Lapack/Lapack_single/CMakeFiles/clubb_lapack_single.dir/slascl.f-pp.f
[278/927] Building Fortran preprocessed src/Lapack/Lapack_single/CMakeFiles/clubb_lapack_single.dir/slaset.f-pp.f
[279/927] Building Fortran preprocessed src/Lapack/Lapack_single/CMakeFiles/clubb_lapack_single.dir/slasr.f-pp.f
[280/927] Building Fortran preprocessed src/Lapack/Lapack_single/CMakeFiles/clubb_lapack_single.dir/slasrt.f-pp.f
[281/927] Building Fortran preprocessed src/Lapack/Lapack_single/CMakeFiles/clubb_lapack_single.dir/slassq.f-pp.f
[282/927] Building Fortran preprocessed src/Lapack/Lapack_single/CMakeFiles/clubb_lapack_single.dir/slaswp.f-pp.f
[283/927] Building Fortran preprocessed src/Lapack/Lapack_single/CMakeFiles/clubb_lapack_single.dir/slatbs.f-pp.f
[284/927] Building Fortran preprocessed src/Lapack/Lapack_single/CMakeFiles/clubb_lapack_single.dir/slatrd.f-pp.f
[285/927] Building Fortran preprocessed src/Lapack/Lapack_single/CMakeFiles/clubb_lapack_single.dir/snrm2.f-pp.f
[286/927] Building Fortran preprocessed src/Lapack/Lapack_single/CMakeFiles/clubb_lapack_single.dir/sorgql.f-pp.f
[287/927] Building Fortran preprocessed src/Lapack/Lapack_single/CMakeFiles/clubb_lapack_single.dir/sorgqr.f-pp.f
[288/927] Building Fortran preprocessed src/Lapack/Lapack_single/CMakeFiles/clubb_lapack_single.dir/spoequ.f-pp.f
[289/927] Building Fortran preprocessed src/Lapack/Lapack_single/CMakeFiles/clubb_lapack_single.dir/sorg2l.f-pp.f
[290/927] Building Fortran preprocessed src/Lapack/Lapack_single/CMakeFiles/clubb_lapack_single.dir/sorgtr.f-pp.f
[291/927] Building Fortran preprocessed src/Lapack/Lapack_single/CMakeFiles/clubb_lapack_single.dir/sorg2r.f-pp.f
[292/927] Building Fortran preprocessed src/Lapack/Lapack_single/CMakeFiles/clubb_lapack_single.dir/spotrf.f-pp.f
[293/927] Building Fortran preprocessed src/Lapack/Lapack_single/CMakeFiles/clubb_lapack_single.dir/srscl.f-pp.f
[294/927] Building Fortran preprocessed src/Lapack/Lapack_single/CMakeFiles/clubb_lapack_single.dir/spotrf2.f-pp.f
[295/927] Building Fortran preprocessed src/Lapack/Lapack_single/CMakeFiles/clubb_lapack_single.dir/sscal.f-pp.f
[296/927] Building Fortran preprocessed src/Lapack/Lapack_single/CMakeFiles/clubb_lapack_single.dir/ssterf.f-pp.f
[297/927] Building Fortran preprocessed src/Lapack/Lapack_single/CMakeFiles/clubb_lapack_single.dir/sswap.f-pp.f
[298/927] Building Fortran preprocessed src/Lapack/Lapack_single/CMakeFiles/clubb_lapack_single.dir/ssteqr.f-pp.f
[299/927] Building Fortran preprocessed src/Lapack/Lapack_single/CMakeFiles/clubb_lapack_single.dir/ssyev.f-pp.f
[300/927] Building Fortran preprocessed src/Lapack/Lapack_single/CMakeFiles/clubb_lapack_single.dir/ssymv.f-pp.f
[301/927] Building Fortran preprocessed src/Lapack/Lapack_single/CMakeFiles/clubb_lapack_single.dir/ssytd2.f-pp.f
[302/927] Building Fortran preprocessed src/Lapack/Lapack_single/CMakeFiles/clubb_lapack_single.dir/ssyr2k.f-pp.f
[303/927] Building Fortran preprocessed src/Lapack/Lapack_single/CMakeFiles/clubb_lapack_single.dir/ssyr2.f-pp.f
[304/927] Building Fortran preprocessed src/Lapack/Lapack_single/CMakeFiles/clubb_lapack_single.dir/ssyrk.f-pp.f
[305/927] Building Fortran preprocessed src/Lapack/Lapack_single/CMakeFiles/clubb_lapack_single.dir/ssytrd.f-pp.f
[306/927] Building Fortran preprocessed src/Lapack/Lapack_single/CMakeFiles/clubb_lapack_single.dir/stbsv.f-pp.f
[307/927] Building Fortran preprocessed src/Lapack/Lapack_single/CMakeFiles/clubb_lapack_single.dir/strmv.f-pp.f
[308/927] Building Fortran preprocessed src/Lapack/Lapack_single/CMakeFiles/clubb_lapack_single.dir/strsm.f-pp.f
[309/927] Building Fortran preprocessed src/Lapack/Lapack_double/CMakeFiles/clubb_lapack_double.dir/dasum.f-pp.f
[310/927] Building Fortran preprocessed src/Lapack/Lapack_single/CMakeFiles/clubb_lapack_single.dir/strmm.f-pp.f
[311/927] Building Fortran preprocessed src/Lapack/Lapack_double/CMakeFiles/clubb_lapack_double.dir/daxpy.f-pp.f
[312/927] Building Fortran preprocessed src/Lapack/Lapack_double/CMakeFiles/clubb_lapack_double.dir/ddot.f-pp.f
[313/927] Building Fortran preprocessed src/Lapack/Lapack_double/CMakeFiles/clubb_lapack_double.dir/dgbcon.f-pp.f
[314/927] Building Fortran preprocessed src/Lapack/Lapack_double/CMakeFiles/clubb_lapack_double.dir/dcopy.f-pp.f
[315/927] Building Fortran preprocessed src/Lapack/Lapack_double/CMakeFiles/clubb_lapack_double.dir/dgbequ.f-pp.f
[316/927] Building Fortran preprocessed src/Lapack/Lapack_double/CMakeFiles/clubb_lapack_double.dir/dgbmv.f-pp.f
[317/927] Building Fortran preprocessed src/Lapack/Lapack_double/CMakeFiles/clubb_lapack_double.dir/dgbrfs.f-pp.f
[318/927] Building Fortran preprocessed src/Lapack/Lapack_double/CMakeFiles/clubb_lapack_double.dir/dgbsvx.f-pp.f
[319/927] Building Fortran preprocessed src/Lapack/Lapack_double/CMakeFiles/clubb_lapack_double.dir/dgbtf2.f-pp.f
[320/927] Building Fortran preprocessed src/Lapack/Lapack_double/CMakeFiles/clubb_lapack_double.dir/dgbtrs.f-pp.f
[321/927] Building Fortran preprocessed src/Lapack/Lapack_double/CMakeFiles/clubb_lapack_double.dir/dgbsv.f-pp.f
[322/927] Building Fortran preprocessed src/Lapack/Lapack_double/CMakeFiles/clubb_lapack_double.dir/dgbtrf.f-pp.f
[323/927] Building Fortran preprocessed src/Lapack/Lapack_double/CMakeFiles/clubb_lapack_double.dir/dgemm.f-pp.f
[324/927] Building Fortran preprocessed src/Lapack/Lapack_double/CMakeFiles/clubb_lapack_double.dir/dger.f-pp.f
[325/927] Building Fortran preprocessed src/Lapack/Lapack_double/CMakeFiles/clubb_lapack_double.dir/dgtcon.f-pp.f
[326/927] Building Fortran preprocessed src/Lapack/Lapack_double/CMakeFiles/clubb_lapack_double.dir/dgtrfs.f-pp.f
[327/927] Building Fortran preprocessed src/Lapack/Lapack_double/CMakeFiles/clubb_lapack_double.dir/dgemv.f-pp.f
[328/927] Generating Fortran dyndep file src/Lapack/Lapack_single/CMakeFiles/clubb_lapack_single.dir/Fortran.dd
[329/927] Building Fortran preprocessed src/Lapack/Lapack_double/CMakeFiles/clubb_lapack_double.dir/dgtsv.f-pp.f
[330/927] Building Fortran preprocessed src/Lapack/Lapack_double/CMakeFiles/clubb_lapack_double.dir/dgtsvx.f-pp.f
[331/927] Building Fortran preprocessed src/Lapack/Lapack_double/CMakeFiles/clubb_lapack_double.dir/dgttrf.f-pp.f
[332/927] Building Fortran preprocessed src/Lapack/Lapack_double/CMakeFiles/clubb_lapack_double.dir/dgttrs.f-pp.f
[333/927] Building Fortran preprocessed src/Lapack/Lapack_double/CMakeFiles/clubb_lapack_double.dir/dgtts2.f-pp.f
[334/927] Building Fortran preprocessed src/Lapack/Lapack_double/CMakeFiles/clubb_lapack_double.dir/disnan.f-pp.f
[335/927] Building Fortran preprocessed src/Lapack/Lapack_double/CMakeFiles/clubb_lapack_double.dir/dlabad.f-pp.f
[336/927] Building Fortran preprocessed src/Lapack/Lapack_double/CMakeFiles/clubb_lapack_double.dir/dlacpy.f-pp.f
[337/927] Building Fortran preprocessed src/Lapack/Lapack_double/CMakeFiles/clubb_lapack_double.dir/dlae2.f-pp.f
[338/927] Building Fortran preprocessed src/Lapack/Lapack_double/CMakeFiles/clubb_lapack_double.dir/dlaev2.f-pp.f
[339/927] Building Fortran preprocessed src/Lapack/Lapack_double/CMakeFiles/clubb_lapack_double.dir/dlagtm.f-pp.f
[340/927] Building Fortran preprocessed src/Lapack/Lapack_double/CMakeFiles/clubb_lapack_double.dir/dlacn2.f-pp.f
[341/927] Building Fortran preprocessed src/Lapack/Lapack_double/CMakeFiles/clubb_lapack_double.dir/dlaisnan.f-pp.f
[342/927] Building Fortran preprocessed src/Lapack/Lapack_double/CMakeFiles/clubb_lapack_double.dir/dlamch.f-pp.f
[343/927] Building Fortran preprocessed src/Lapack/Lapack_double/CMakeFiles/clubb_lapack_double.dir/dlangb.f-pp.f
[344/927] Building Fortran preprocessed src/Lapack/Lapack_double/CMakeFiles/clubb_lapack_double.dir/dlanst.f-pp.f
[345/927] Building Fortran preprocessed src/Lapack/Lapack_double/CMakeFiles/clubb_lapack_double.dir/dlansy.f-pp.f
[346/927] Building Fortran preprocessed src/Lapack/Lapack_double/CMakeFiles/clubb_lapack_double.dir/dlantb.f-pp.f
[347/927] Building Fortran preprocessed src/Lapack/Lapack_double/CMakeFiles/clubb_lapack_double.dir/dlangt.f-pp.f
[348/927] Building Fortran preprocessed src/Lapack/Lapack_double/CMakeFiles/clubb_lapack_double.dir/dlarfg.f-pp.f
[349/927] Building Fortran preprocessed src/Lapack/Lapack_double/CMakeFiles/clubb_lapack_double.dir/dlarft.f-pp.f
[350/927] Building Fortran preprocessed src/Lapack/Lapack_double/CMakeFiles/clubb_lapack_double.dir/dlaqgb.f-pp.f
[351/927] Building Fortran preprocessed src/Lapack/Lapack_double/CMakeFiles/clubb_lapack_double.dir/dlaqsy.f-pp.f
[352/927] Building Fortran preprocessed src/Lapack/Lapack_double/CMakeFiles/clubb_lapack_double.dir/dlasr.f-pp.f
[353/927] Building Fortran preprocessed src/Lapack/Lapack_double/CMakeFiles/clubb_lapack_double.dir/dlapy2.f-pp.f
[354/927] Building Fortran preprocessed src/Lapack/Lapack_double/CMakeFiles/clubb_lapack_double.dir/dlartg.f-pp.f
[355/927] Building Fortran preprocessed src/Lapack/Lapack_double/CMakeFiles/clubb_lapack_double.dir/dlaset.f-pp.f
[356/927] Building Fortran preprocessed src/Lapack/Lapack_double/CMakeFiles/clubb_lapack_double.dir/dlascl.f-pp.f
[357/927] Building Fortran preprocessed src/Lapack/Lapack_double/CMakeFiles/clubb_lapack_double.dir/dlasrt.f-pp.f
[358/927] Building Fortran preprocessed src/Lapack/Lapack_double/CMakeFiles/clubb_lapack_double.dir/dlassq.f-pp.f
[359/927] Building Fortran object src/Lapack/Lapack_single/CMakeFiles/clubb_lapack_single.dir/ilaslr.f.o
[360/927] Building Fortran object src/Lapack/Lapack_single/CMakeFiles/clubb_lapack_single.dir/isamax.f.o
[361/927] Building Fortran object src/Lapack/Lapack_single/CMakeFiles/clubb_lapack_single.dir/ilaslc.f.o
[362/927] Building Fortran object src/Lapack/Lapack_single/CMakeFiles/clubb_lapack_single.dir/sgbsv.f.o
[363/927] Building Fortran object src/Lapack/Lapack_single/CMakeFiles/clubb_lapack_single.dir/sisnan.f.o
[364/927] Building Fortran object src/Lapack/Lapack_single/CMakeFiles/clubb_lapack_single.dir/slabad.f.o
[365/927] Building Fortran object src/Lapack/Lapack_single/CMakeFiles/clubb_lapack_single.dir/sasum.f.o
[366/927] Building Fortran object src/Lapack/Lapack_single/CMakeFiles/clubb_lapack_single.dir/sdot.f.o
[367/927] Building Fortran object src/Lapack/Lapack_single/CMakeFiles/clubb_lapack_single.dir/saxpy.f.o
[368/927] Building Fortran object src/Lapack/Lapack_single/CMakeFiles/clubb_lapack_single.dir/scopy.f.o
[369/927] Building Fortran object src/Lapack/Lapack_single/CMakeFiles/clubb_lapack_single.dir/sgtcon.f.o
[370/927] Building Fortran object src/Lapack/Lapack_single/CMakeFiles/clubb_lapack_single.dir/slae2.f.o
[371/927] Building Fortran object src/Lapack/Lapack_single/CMakeFiles/clubb_lapack_single.dir/sgtsvx.f.o
[372/927] Building Fortran object src/Lapack/Lapack_single/CMakeFiles/clubb_lapack_single.dir/slacpy.f.o
[373/927] Building Fortran object src/Lapack/Lapack_single/CMakeFiles/clubb_lapack_single.dir/sgttrs.f.o
[374/927] Building Fortran object src/Lapack/Lapack_single/CMakeFiles/clubb_lapack_single.dir/sgttrf.f.o
[375/927] Building Fortran object src/Lapack/Lapack_single/CMakeFiles/clubb_lapack_single.dir/slaisnan.f.o
[376/927] Building Fortran object src/Lapack/Lapack_single/CMakeFiles/clubb_lapack_single.dir/sger.f.o
[377/927] Building Fortran object src/Lapack/Lapack_single/CMakeFiles/clubb_lapack_single.dir/sgbtf2.f.o
[378/927] Building Fortran object src/Lapack/Lapack_single/CMakeFiles/clubb_lapack_single.dir/slacn2.f.o
[379/927] Building Fortran object src/Lapack/Lapack_single/CMakeFiles/clubb_lapack_single.dir/sgbtrs.f.o
[380/927] Building Fortran object src/Lapack/Lapack_single/CMakeFiles/clubb_lapack_single.dir/slaev2.f.o
[381/927] Building Fortran object src/Lapack/Lapack_single/CMakeFiles/clubb_lapack_single.dir/sgbcon.f.o
[382/927] Building Fortran object src/Lapack/Lapack_single/CMakeFiles/clubb_lapack_single.dir/slamch.f.o
[383/927] Building Fortran object src/Lapack/Lapack_single/CMakeFiles/clubb_lapack_single.dir/sgbequ.f.o
[384/927] Building Fortran object src/Lapack/Lapack_single/CMakeFiles/clubb_lapack_single.dir/slapy2.f.o
[385/927] Building Fortran object src/Lapack/Lapack_single/CMakeFiles/clubb_lapack_single.dir/slanst.f.o
[386/927] Building Fortran object src/Lapack/Lapack_single/CMakeFiles/clubb_lapack_single.dir/slaqsy.f.o
[387/927] Building Fortran object src/Lapack/Lapack_single/CMakeFiles/clubb_lapack_single.dir/slarf.f.o
[388/927] Building Fortran object src/Lapack/Lapack_single/CMakeFiles/clubb_lapack_single.dir/slarfg.f.o
[389/927] Building Fortran object src/Lapack/Lapack_single/CMakeFiles/clubb_lapack_single.dir/sgemv.f.o
[390/927] Building Fortran object src/Lapack/Lapack_single/CMakeFiles/clubb_lapack_single.dir/sgbmv.f.o
[391/927] Building Fortran object src/Lapack/Lapack_single/CMakeFiles/clubb_lapack_single.dir/slangt.f.o
[392/927] Building Fortran object src/Lapack/Lapack_single/CMakeFiles/clubb_lapack_single.dir/slartg.f.o
[393/927] Building Fortran object src/Lapack/Lapack_single/CMakeFiles/clubb_lapack_single.dir/slassq.f.o
[394/927] Building Fortran object src/Lapack/Lapack_single/CMakeFiles/clubb_lapack_single.dir/slaqgb.f.o
[395/927] Building Fortran object src/Lapack/Lapack_single/CMakeFiles/clubb_lapack_single.dir/sgtts2.f.o
[396/927] Building Fortran object src/Lapack/Lapack_single/CMakeFiles/clubb_lapack_single.dir/slangb.f.o
[397/927] Building Fortran object src/Lapack/Lapack_single/CMakeFiles/clubb_lapack_single.dir/snrm2.f.o
[398/927] Building Fortran object src/Lapack/Lapack_single/CMakeFiles/clubb_lapack_single.dir/sgtsv.f.o
[399/927] Building Fortran object src/Lapack/Lapack_single/CMakeFiles/clubb_lapack_single.dir/slaset.f.o
[400/927] Building Fortran object src/Lapack/Lapack_single/CMakeFiles/clubb_lapack_single.dir/slansy.f.o
[401/927] Building Fortran object src/Lapack/Lapack_single/CMakeFiles/clubb_lapack_single.dir/slaswp.f.o
[402/927] Building Fortran object src/Lapack/Lapack_single/CMakeFiles/clubb_lapack_single.dir/sgbrfs.f.o
[403/927] Building Fortran object src/Lapack/Lapack_single/CMakeFiles/clubb_lapack_single.dir/sgemm.f.o
[404/927] Building Fortran object src/Lapack/Lapack_single/CMakeFiles/clubb_lapack_single.dir/sgtrfs.f.o
[405/927] Building Fortran object src/Lapack/Lapack_single/CMakeFiles/clubb_lapack_single.dir/slasrt.f.o
[406/927] Building Fortran object src/Lapack/Lapack_single/CMakeFiles/clubb_lapack_single.dir/srscl.f.o
[407/927] Building Fortran object src/Lapack/Lapack_single/CMakeFiles/clubb_lapack_single.dir/sorg2l.f.o
[408/927] Building Fortran object src/Lapack/Lapack_single/CMakeFiles/clubb_lapack_single.dir/slagtm.f.o
[409/927] Building Fortran object src/Lapack/Lapack_single/CMakeFiles/clubb_lapack_single.dir/sgbsvx.f.o
[410/927] Building Fortran object src/Lapack/Lapack_single/CMakeFiles/clubb_lapack_single.dir/sorg2r.f.o
[411/927] Building Fortran object src/Lapack/Lapack_single/CMakeFiles/clubb_lapack_single.dir/spotrf2.f.o
[412/927] Building Fortran object src/Lapack/Lapack_single/CMakeFiles/clubb_lapack_single.dir/spoequ.f.o
[413/927] Building Fortran object src/Lapack/Lapack_single/CMakeFiles/clubb_lapack_single.dir/sscal.f.o
[414/927] Building Fortran object src/Lapack/Lapack_single/CMakeFiles/clubb_lapack_single.dir/slatrd.f.o
[415/927] Building Fortran object src/Lapack/Lapack_single/CMakeFiles/clubb_lapack_single.dir/sswap.f.o
[416/927] Building Fortran object src/Lapack/Lapack_single/CMakeFiles/clubb_lapack_single.dir/sorgtr.f.o
[417/927] Building Fortran preprocessed src/Lapack/Lapack_double/CMakeFiles/clubb_lapack_double.dir/dlaswp.f-pp.f
[418/927] Building Fortran preprocessed src/Lapack/Lapack_double/CMakeFiles/clubb_lapack_double.dir/dlatbs.f-pp.f
[419/927] Building Fortran preprocessed src/Lapack/Lapack_double/CMakeFiles/clubb_lapack_double.dir/dlatrd.f-pp.f
[420/927] Building Fortran preprocessed src/Lapack/Lapack_double/CMakeFiles/clubb_lapack_double.dir/dnrm2.f-pp.f
[421/927] Building Fortran object src/Lapack/Lapack_single/CMakeFiles/clubb_lapack_single.dir/spotrf.f.o
[422/927] Building Fortran object src/Lapack/Lapack_single/CMakeFiles/clubb_lapack_single.dir/ssyev.f.o
[423/927] Building Fortran preprocessed src/Lapack/Lapack_double/CMakeFiles/clubb_lapack_double.dir/dorg2l.f-pp.f
[424/927] Building Fortran object src/Lapack/Lapack_single/CMakeFiles/clubb_lapack_single.dir/sorgql.f.o
[425/927] Building Fortran object src/Lapack/Lapack_single/CMakeFiles/clubb_lapack_single.dir/slarft.f.o
[426/927] Building Fortran object src/Lapack/Lapack_single/CMakeFiles/clubb_lapack_single.dir/slascl.f.o
[427/927] Building Fortran preprocessed src/Lapack/Lapack_double/CMakeFiles/clubb_lapack_double.dir/dorg2r.f-pp.f
[428/927] Building Fortran preprocessed src/Lapack/Lapack_double/CMakeFiles/clubb_lapack_double.dir/dorgql.f-pp.f
[429/927] Building Fortran preprocessed src/Lapack/Lapack_double/CMakeFiles/clubb_lapack_double.dir/dorgqr.f-pp.f
[430/927] Building Fortran object src/Lapack/Lapack_single/CMakeFiles/clubb_lapack_single.dir/sorgqr.f.o
[431/927] Building Fortran preprocessed src/Lapack/Lapack_double/CMakeFiles/clubb_lapack_double.dir/dorgtr.f-pp.f
[432/927] Building Fortran preprocessed src/Lapack/Lapack_double/CMakeFiles/clubb_lapack_double.dir/dpoequ.f-pp.f
[433/927] Building Fortran preprocessed src/Lapack/Lapack_double/CMakeFiles/clubb_lapack_double.dir/dpotrf2.f-pp.f
[434/927] Building Fortran preprocessed src/Lapack/Lapack_double/CMakeFiles/clubb_lapack_double.dir/drscl.f-pp.f
[435/927] Building Fortran object src/Microphys/SCM_Activation/CMakeFiles/scm_activation_lib.dir/aer_ccn_act_k.F90.o
[436/927] Building Fortran preprocessed src/Lapack/Lapack_double/CMakeFiles/clubb_lapack_double.dir/dpotrf.f-pp.f
[437/927] Building Fortran preprocessed src/Lapack/Lapack_double/CMakeFiles/clubb_lapack_double.dir/dscal.f-pp.f
[438/927] Building Fortran preprocessed src/Lapack/Lapack_double/CMakeFiles/clubb_lapack_double.dir/dsteqr.f-pp.f
[439/927] Building Fortran preprocessed src/Lapack/Lapack_double/CMakeFiles/clubb_lapack_double.dir/dsterf.f-pp.f
[440/927] Building Fortran preprocessed src/Lapack/Lapack_double/CMakeFiles/clubb_lapack_double.dir/dsyev.f-pp.f
[441/927] Building Fortran preprocessed src/Lapack/Lapack_double/CMakeFiles/clubb_lapack_double.dir/dswap.f-pp.f
[442/927] Building Fortran preprocessed src/Lapack/Lapack_double/CMakeFiles/clubb_lapack_double.dir/dsymv.f-pp.f
[443/927] Building Fortran preprocessed src/Lapack/Lapack_double/CMakeFiles/clubb_lapack_double.dir/dsyrk.f-pp.f
[444/927] Building Fortran preprocessed src/Lapack/Lapack_double/CMakeFiles/clubb_lapack_double.dir/dsyr2.f-pp.f
[445/927] Building Fortran preprocessed src/Lapack/Lapack_double/CMakeFiles/clubb_lapack_double.dir/dsyr2k.f-pp.f
[446/927] Building Fortran preprocessed src/Lapack/Lapack_double/CMakeFiles/clubb_lapack_double.dir/dsytrd.f-pp.f
[447/927] Building Fortran object src/Lapack/Lapack_single/CMakeFiles/clubb_lapack_single.dir/ssyr2.f.o
[448/927] Building Fortran preprocessed src/Lapack/Lapack_double/CMakeFiles/clubb_lapack_double.dir/dsytd2.f-pp.f
[449/927] Building Fortran preprocessed src/Lapack/Lapack_double/CMakeFiles/clubb_lapack_double.dir/dtbsv.f-pp.f
[450/927] Building Fortran preprocessed src/Lapack/Lapack_double/CMakeFiles/clubb_lapack_double.dir/dtrmm.f-pp.f
[451/927] Building Fortran object src/Lapack/Lapack_single/CMakeFiles/clubb_lapack_single.dir/ssytd2.f.o
[452/927] Building Fortran preprocessed src/Lapack/Lapack_double/CMakeFiles/clubb_lapack_double.dir/dtrmv.f-pp.f
[453/927] Building Fortran preprocessed src/Lapack/Lapack_double/CMakeFiles/clubb_lapack_double.dir/dtrsm.f-pp.f
[454/927] Building Fortran preprocessed src/Lapack/Lapack_double/CMakeFiles/clubb_lapack_double.dir/idamax.f-pp.f
[455/927] Building Fortran preprocessed src/Lapack/Lapack_double/CMakeFiles/clubb_lapack_double.dir/ieeeck.f-pp.f
[456/927] Building Fortran preprocessed src/Lapack/Lapack_double/CMakeFiles/clubb_lapack_double.dir/iladlr.f-pp.f
[457/927] Building Fortran preprocessed src/Lapack/Lapack_double/CMakeFiles/clubb_lapack_double.dir/iladlc.f-pp.f
[458/927] Building Fortran object src/Lapack/Lapack_single/CMakeFiles/clubb_lapack_single.dir/slantb.f.o
[459/927] Building Fortran preprocessed src/Lapack/Lapack_double/CMakeFiles/clubb_lapack_double.dir/ilaenv.f-pp.f
[460/927] Building Fortran preprocessed src/Lapack/Lapack_double/CMakeFiles/clubb_lapack_double.dir/iparmq.f-pp.f
[461/927] Building Fortran preprocessed src/Lapack/Lapack_shared/CMakeFiles/clubb_lapack_shared.dir/lsame.f-pp.f
[462/927] Building Fortran object src/Lapack/Lapack_single/CMakeFiles/clubb_lapack_single.dir/sgbtrf.f.o
[463/927] Building Fortran preprocessed src/Lapack/Lapack_shared/CMakeFiles/clubb_lapack_shared.dir/xerbla.f-pp.f
[464/927] Building Fortran preprocessed src/Input_fields/CMakeFiles/input_fields_lib.dir/sounding.F90-pp.f90
[465/927] Building Fortran preprocessed src/Input_fields/CMakeFiles/input_fields_lib.dir/input_fields.F90-pp.f90
[466/927] Building Fortran preprocessed src/Input_fields/CMakeFiles/input_fields_lib.dir/input_reader.F90-pp.f90
[467/927] Building Fortran preprocessed src/Input_fields/CMakeFiles/input_fields_lib.dir/stat_file_utils.F90-pp.f90
[468/927] Building Fortran preprocessed src/Input_fields/CMakeFiles/input_fields_lib.dir/input_names.F90-pp.f90
[469/927] Building Fortran preprocessed src/Input_fields/CMakeFiles/input_fields_lib.dir/stat_file_module.F90-pp.f90
[470/927] Building Fortran object src/Lapack/Lapack_single/CMakeFiles/clubb_lapack_single.dir/ssymv.f.o
[471/927] Building Fortran object src/Lapack/Lapack_single/CMakeFiles/clubb_lapack_single.dir/ssytrd.f.o
[472/927] Building Fortran preprocessed src/Input_fields/CMakeFiles/input_fields_lib.dir/input_netcdf.F90-pp.f90
[473/927] Building Fortran preprocessed src/Input_fields/CMakeFiles/input_fields_lib.dir/hydrostatic_module.F90-pp.f90
[474/927] Building Fortran preprocessed src/Input_fields/CMakeFiles/input_fields_lib.dir/corr_varnce_input_reader.F90-pp.f90
[475/927] Building Fortran preprocessed src/Input_fields/CMakeFiles/input_fields_lib.dir/extrapolation.F90-pp.f90
[476/927] Generating Fortran dyndep file src/Lapack/Lapack_double/CMakeFiles/clubb_lapack_double.dir/Fortran.dd
[477/927] Building Fortran preprocessed src/Input_fields/CMakeFiles/input_fields_lib.dir/input_interpret.F90-pp.f90
[478/927] Building Fortran preprocessed src/Input_fields/CMakeFiles/input_fields_lib.dir/__/readiopdata_module.F90-pp.f90
[479/927] Generating Fortran dyndep file src/Lapack/Lapack_shared/CMakeFiles/clubb_lapack_shared.dir/Fortran.dd
[480/927] Building Fortran object src/Lapack/Lapack_single/CMakeFiles/clubb_lapack_single.dir/slasr.f.o
[481/927] Building Fortran preprocessed src/Benchmark_cases/CMakeFiles/benchmark_cases_lib.dir/arm.F90-pp.f90
[482/927] Building Fortran preprocessed src/Input_fields/CMakeFiles/input_fields_lib.dir/__/readiopdata_core/readiopdata_core_module.F90-pp.f90
[483/927] Building Fortran preprocessed src/Benchmark_cases/CMakeFiles/benchmark_cases_lib.dir/arm_3year.F90-pp.f90
[484/927] Building Fortran preprocessed src/Benchmark_cases/CMakeFiles/benchmark_cases_lib.dir/arm_0003.F90-pp.f90
[485/927] Linking Fortran static library src/Microphys/SCM_Activation/libscm_activation_lib.a
[486/927] Building Fortran preprocessed src/Benchmark_cases/CMakeFiles/benchmark_cases_lib.dir/arm_97.F90-pp.f90
[487/927] Building Fortran preprocessed src/Benchmark_cases/CMakeFiles/benchmark_cases_lib.dir/atex.F90-pp.f90
[488/927] Building Fortran preprocessed src/Benchmark_cases/CMakeFiles/benchmark_cases_lib.dir/clex9_nov02.F90-pp.f90
[489/927] Building Fortran preprocessed src/Benchmark_cases/CMakeFiles/benchmark_cases_lib.dir/astex_a209.F90-pp.f90
[490/927] Building Fortran preprocessed src/Benchmark_cases/CMakeFiles/benchmark_cases_lib.dir/bomex.F90-pp.f90
[491/927] Building Fortran preprocessed src/Benchmark_cases/CMakeFiles/benchmark_cases_lib.dir/clex9_oct14.F90-pp.f90
[492/927] Building Fortran preprocessed src/Benchmark_cases/CMakeFiles/benchmark_cases_lib.dir/cloud_feedback.F90-pp.f90
[493/927] Building Fortran preprocessed src/Benchmark_cases/CMakeFiles/benchmark_cases_lib.dir/cobra.F90-pp.f90
[494/927] Building Fortran preprocessed src/Benchmark_cases/CMakeFiles/benchmark_cases_lib.dir/atex_long.F90-pp.f90
[495/927] Building Fortran preprocessed src/Benchmark_cases/CMakeFiles/benchmark_cases_lib.dir/dycoms2_rf02.F90-pp.f90
[496/927] Building Fortran preprocessed src/Benchmark_cases/CMakeFiles/benchmark_cases_lib.dir/diag_ustar_module.F90-pp.f90
[497/927] Building Fortran preprocessed src/Benchmark_cases/CMakeFiles/benchmark_cases_lib.dir/dycoms2_rf01.F90-pp.f90
[498/927] Building Fortran object src/Lapack/Lapack_single/CMakeFiles/clubb_lapack_single.dir/ssterf.f.o
[499/927] Building Fortran object src/Lapack/Lapack_single/CMakeFiles/clubb_lapack_single.dir/slatbs.f.o
[500/927] Building Fortran object src/Lapack/Lapack_single/CMakeFiles/clubb_lapack_single.dir/strmv.f.o
[501/927] Building Fortran object src/Lapack/Lapack_double/CMakeFiles/clubb_lapack_double.dir/dgbsv.f.o
[502/927] Building Fortran object src/Lapack/Lapack_single/CMakeFiles/clubb_lapack_single.dir/ssyrk.f.o
[503/927] Building Fortran object src/Lapack/Lapack_double/CMakeFiles/clubb_lapack_double.dir/dasum.f.o
[504/927] Building Fortran object src/Lapack/Lapack_single/CMakeFiles/clubb_lapack_single.dir/ssyr2k.f.o
[505/927] Building Fortran object src/Lapack/Lapack_double/CMakeFiles/clubb_lapack_double.dir/daxpy.f.o
[506/927] Building Fortran object src/Lapack/Lapack_single/CMakeFiles/clubb_lapack_single.dir/slarfb.f.o
[507/927] Building Fortran object src/Lapack/Lapack_single/CMakeFiles/clubb_lapack_single.dir/stbsv.f.o
[508/927] Building Fortran object src/Lapack/Lapack_double/CMakeFiles/clubb_lapack_double.dir/dcopy.f.o
[509/927] Building Fortran object src/Lapack/Lapack_double/CMakeFiles/clubb_lapack_double.dir/ddot.f.o
[510/927] Building Fortran object src/Lapack/Lapack_double/CMakeFiles/clubb_lapack_double.dir/dgtcon.f.o
[511/927] Building Fortran object src/Lapack/Lapack_double/CMakeFiles/clubb_lapack_double.dir/dgtsvx.f.o
[512/927] Building Fortran object src/Lapack/Lapack_double/CMakeFiles/clubb_lapack_double.dir/dger.f.o
[513/927] Building Fortran object src/Lapack/Lapack_double/CMakeFiles/clubb_lapack_double.dir/disnan.f.o
[514/927] Building Fortran object src/Lapack/Lapack_double/CMakeFiles/clubb_lapack_double.dir/dlabad.f.o
[515/927] Building Fortran object src/Lapack/Lapack_double/CMakeFiles/clubb_lapack_double.dir/dgttrs.f.o
[516/927] Building Fortran object src/Lapack/Lapack_double/CMakeFiles/clubb_lapack_double.dir/dgttrf.f.o
[517/927] Building Fortran object src/Lapack/Lapack_single/CMakeFiles/clubb_lapack_single.dir/ssteqr.f.o
[518/927] Building Fortran object src/Lapack/Lapack_double/CMakeFiles/clubb_lapack_double.dir/dlaisnan.f.o
[519/927] Building Fortran object src/Lapack/Lapack_double/CMakeFiles/clubb_lapack_double.dir/dgbtrs.f.o
[520/927] Building Fortran object src/Lapack/Lapack_double/CMakeFiles/clubb_lapack_double.dir/dgbtf2.f.o
[521/927] Building Fortran object src/Lapack/Lapack_double/CMakeFiles/clubb_lapack_double.dir/dlae2.f.o
[522/927] Building Fortran object src/Lapack/Lapack_double/CMakeFiles/clubb_lapack_double.dir/dgbcon.f.o
[523/927] Building Fortran object src/Lapack/Lapack_double/CMakeFiles/clubb_lapack_double.dir/dgbequ.f.o
[524/927] Building Fortran object src/Lapack/Lapack_double/CMakeFiles/clubb_lapack_double.dir/dlacpy.f.o
[525/927] Building Fortran object src/Lapack/Lapack_double/CMakeFiles/clubb_lapack_double.dir/dlaev2.f.o
[526/927] Building Fortran object src/Lapack/Lapack_double/CMakeFiles/clubb_lapack_double.dir/dlamch.f.o
[527/927] Building Fortran object src/Lapack/Lapack_double/CMakeFiles/clubb_lapack_double.dir/dlapy2.f.o
[528/927] Building Fortran object src/Lapack/Lapack_double/CMakeFiles/clubb_lapack_double.dir/dgemv.f.o
[529/927] Building Fortran object src/Lapack/Lapack_double/CMakeFiles/clubb_lapack_double.dir/dlacn2.f.o
[530/927] Building Fortran object src/Lapack/Lapack_double/CMakeFiles/clubb_lapack_double.dir/dgbmv.f.o
[531/927] Building Fortran object src/Lapack/Lapack_double/CMakeFiles/clubb_lapack_double.dir/dlanst.f.o
[532/927] Building Fortran object src/Lapack/Lapack_double/CMakeFiles/clubb_lapack_double.dir/dlarf.f.o
[533/927] Building Fortran object src/Lapack/Lapack_double/CMakeFiles/clubb_lapack_double.dir/dlangt.f.o
[534/927] Building Fortran object src/Lapack/Lapack_double/CMakeFiles/clubb_lapack_double.dir/dlaqsy.f.o
[535/927] Building Fortran object src/Lapack/Lapack_double/CMakeFiles/clubb_lapack_double.dir/dlarfg.f.o
[536/927] Building Fortran object src/Lapack/Lapack_double/CMakeFiles/clubb_lapack_double.dir/dlassq.f.o
[537/927] Building Fortran object src/Lapack/Lapack_double/CMakeFiles/clubb_lapack_double.dir/dgtsv.f.o
[538/927] Building Fortran object src/Lapack/Lapack_double/CMakeFiles/clubb_lapack_double.dir/dlartg.f.o
[539/927] Building Fortran object src/Lapack/Lapack_double/CMakeFiles/clubb_lapack_double.dir/dlangb.f.o
[540/927] Building Fortran object src/Lapack/Lapack_single/CMakeFiles/clubb_lapack_single.dir/strmm.f.o
[541/927] Building Fortran object src/Lapack/Lapack_double/CMakeFiles/clubb_lapack_double.dir/dgtts2.f.o
[542/927] Building Fortran object src/Lapack/Lapack_double/CMakeFiles/clubb_lapack_double.dir/dlaqgb.f.o
[543/927] Building Fortran object src/Lapack/Lapack_double/CMakeFiles/clubb_lapack_double.dir/dlaset.f.o
[544/927] Building Fortran object src/Lapack/Lapack_double/CMakeFiles/clubb_lapack_double.dir/dgbrfs.f.o
[545/927] Building Fortran object src/Lapack/Lapack_double/CMakeFiles/clubb_lapack_double.dir/dnrm2.f.o
[546/927] Building Fortran object src/Lapack/Lapack_double/CMakeFiles/clubb_lapack_double.dir/dgemm.f.o
[547/927] Building Fortran object src/Lapack/Lapack_double/CMakeFiles/clubb_lapack_double.dir/dgtrfs.f.o
[548/927] Building Fortran object src/Lapack/Lapack_double/CMakeFiles/clubb_lapack_double.dir/dlansy.f.o
[549/927] Building Fortran object src/Lapack/Lapack_double/CMakeFiles/clubb_lapack_double.dir/dgbsvx.f.o
[550/927] Building Fortran object src/Lapack/Lapack_double/CMakeFiles/clubb_lapack_double.dir/dlaswp.f.o
[551/927] Building Fortran object src/Lapack/Lapack_double/CMakeFiles/clubb_lapack_double.dir/dpoequ.f.o
[552/927] Building Fortran object src/Lapack/Lapack_double/CMakeFiles/clubb_lapack_double.dir/drscl.f.o
[553/927] Building Fortran object src/Lapack/Lapack_double/CMakeFiles/clubb_lapack_double.dir/dlagtm.f.o
[554/927] Building Fortran object src/Lapack/Lapack_double/CMakeFiles/clubb_lapack_double.dir/dlasrt.f.o
[555/927] Building Fortran object src/Lapack/Lapack_double/CMakeFiles/clubb_lapack_double.dir/dorg2l.f.o
[556/927] Building Fortran object src/Lapack/Lapack_single/CMakeFiles/clubb_lapack_single.dir/strsm.f.o
[557/927] Building Fortran object src/Lapack/Lapack_double/CMakeFiles/clubb_lapack_double.dir/dorg2r.f.o
[558/927] Building Fortran object src/Lapack/Lapack_double/CMakeFiles/clubb_lapack_double.dir/dscal.f.o
[559/927] Building Fortran object src/Lapack/Lapack_double/CMakeFiles/clubb_lapack_double.dir/dpotrf2.f.o
[560/927] Building Fortran object src/Lapack/Lapack_double/CMakeFiles/clubb_lapack_double.dir/dswap.f.o
[561/927] Building Fortran object src/Lapack/Lapack_double/CMakeFiles/clubb_lapack_double.dir/dsyev.f.o
[562/927] Building Fortran object src/Lapack/Lapack_double/CMakeFiles/clubb_lapack_double.dir/dorgtr.f.o
[563/927] Building Fortran object src/Lapack/Lapack_double/CMakeFiles/clubb_lapack_double.dir/dpotrf.f.o
[564/927] Building Fortran object src/Lapack/Lapack_double/CMakeFiles/clubb_lapack_double.dir/dlascl.f.o
[565/927] Building Fortran object src/Lapack/Lapack_double/CMakeFiles/clubb_lapack_double.dir/dlatrd.f.o
[566/927] Building Fortran object src/Lapack/Lapack_double/CMakeFiles/clubb_lapack_double.dir/dorgqr.f.o
[567/927] Building Fortran object src/Lapack/Lapack_double/CMakeFiles/clubb_lapack_double.dir/dorgql.f.o
[568/927] Building Fortran object src/Lapack/Lapack_double/CMakeFiles/clubb_lapack_double.dir/dlarft.f.o
[569/927] Building Fortran object src/Lapack/Lapack_double/CMakeFiles/clubb_lapack_double.dir/idamax.f.o
[570/927] Building Fortran object src/Lapack/Lapack_double/CMakeFiles/clubb_lapack_double.dir/iladlc.f.o
[571/927] Building Fortran object src/Lapack/Lapack_double/CMakeFiles/clubb_lapack_double.dir/ieeeck.f.o
[572/927] Building Fortran preprocessed src/Benchmark_cases/CMakeFiles/benchmark_cases_lib.dir/gabls2.F90-pp.f90
[573/927] Building Fortran object src/Lapack/Lapack_double/CMakeFiles/clubb_lapack_double.dir/iladlr.f.o
[574/927] Building Fortran preprocessed src/Benchmark_cases/CMakeFiles/benchmark_cases_lib.dir/fire.F90-pp.f90
[575/927] Building Fortran object src/Lapack/Lapack_double/CMakeFiles/clubb_lapack_double.dir/dsytd2.f.o
[576/927] Building Fortran preprocessed src/Benchmark_cases/CMakeFiles/benchmark_cases_lib.dir/jun25.F90-pp.f90
[577/927] Building Fortran object src/Lapack/Lapack_shared/CMakeFiles/clubb_lapack_shared.dir/lsame.f.o
[578/927] Building Fortran preprocessed src/Benchmark_cases/CMakeFiles/benchmark_cases_lib.dir/gabls3_night.F90-pp.f90
[579/927] Building Fortran preprocessed src/Benchmark_cases/CMakeFiles/benchmark_cases_lib.dir/gabls3.F90-pp.f90
[580/927] Building Fortran object src/Lapack/Lapack_double/CMakeFiles/clubb_lapack_double.dir/dsyr2.f.o
[581/927] Building Fortran object src/Lapack/Lapack_shared/CMakeFiles/clubb_lapack_shared.dir/xerbla.f.o
[582/927] Building Fortran preprocessed src/Benchmark_cases/CMakeFiles/benchmark_cases_lib.dir/lba.F90-pp.f90
[583/927] Building Fortran preprocessed src/Benchmark_cases/CMakeFiles/benchmark_cases_lib.dir/mpace_b.F90-pp.f90
[584/927] Building Fortran preprocessed src/Benchmark_cases/CMakeFiles/benchmark_cases_lib.dir/mpace_a.F90-pp.f90
[585/927] Building Fortran preprocessed src/Benchmark_cases/CMakeFiles/benchmark_cases_lib.dir/nov11.F90-pp.f90
[586/927] Building Fortran object src/Lapack/Lapack_double/CMakeFiles/clubb_lapack_double.dir/dlarfb.f.o
[587/927] Building Fortran preprocessed src/Benchmark_cases/CMakeFiles/benchmark_cases_lib.dir/rico.F90-pp.f90
[588/927] Building Fortran object src/Lapack/Lapack_double/CMakeFiles/clubb_lapack_double.dir/iparmq.f.o
[589/927] Building Fortran preprocessed src/Benchmark_cases/CMakeFiles/benchmark_cases_lib.dir/spec_hum_to_mixing_ratio.F90-pp.f90
[590/927] Building Fortran object src/Lapack/Lapack_double/CMakeFiles/clubb_lapack_double.dir/dgbtrf.f.o
[591/927] Building Fortran preprocessed src/Benchmark_cases/CMakeFiles/benchmark_cases_lib.dir/neutral_case.F90-pp.f90
[592/927] Building Fortran preprocessed src/Benchmark_cases/CMakeFiles/benchmark_cases_lib.dir/sfc_flux.F90-pp.f90
[593/927] Building Fortran preprocessed src/Benchmark_cases/CMakeFiles/benchmark_cases_lib.dir/twp_ice.F90-pp.f90
[594/927] Building Fortran preprocessed src/Benchmark_cases/CMakeFiles/benchmark_cases_lib.dir/ekman.F90-pp.f90
[595/927] Building Fortran preprocessed src/Benchmark_cases/CMakeFiles/benchmark_cases_lib.dir/wangara.F90-pp.f90
[596/927] Building Fortran preprocessed src/Benchmark_cases/CMakeFiles/benchmark_cases_lib.dir/time_dependent_input.F90-pp.f90
[597/927] Building Fortran preprocessed src/Benchmark_cases/CMakeFiles/benchmark_cases_lib.dir/prescribe_forcings.F90-pp.f90
[598/927] Building Fortran object src/Lapack/Lapack_double/CMakeFiles/clubb_lapack_double.dir/dlantb.f.o
[599/927] Building Fortran object src/Lapack/Lapack_double/CMakeFiles/clubb_lapack_double.dir/dsymv.f.o
[600/927] Building Fortran object src/Lapack/Lapack_double/CMakeFiles/clubb_lapack_double.dir/dsytrd.f.o
[601/927] Building Fortran object src/Lapack/Lapack_double/CMakeFiles/clubb_lapack_double.dir/dsterf.f.o
[602/927] Building Fortran object src/Lapack/Lapack_double/CMakeFiles/clubb_lapack_double.dir/dlasr.f.o
[603/927] Building Fortran object src/Lapack/Lapack_double/CMakeFiles/clubb_lapack_double.dir/ilaenv.f.o
[604/927] Building Fortran object src/Lapack/Lapack_double/CMakeFiles/clubb_lapack_double.dir/dlatbs.f.o
[605/927] Building Fortran object src/Lapack/Lapack_double/CMakeFiles/clubb_lapack_double.dir/dtbsv.f.o
[606/927] Building Fortran object src/Lapack/Lapack_double/CMakeFiles/clubb_lapack_double.dir/dsyrk.f.o
[607/927] Building Fortran object src/Lapack/Lapack_double/CMakeFiles/clubb_lapack_double.dir/dtrmv.f.o
[608/927] Building Fortran object src/Lapack/Lapack_double/CMakeFiles/clubb_lapack_double.dir/dsyr2k.f.o
[609/927] Building Fortran object src/Lapack/Lapack_double/CMakeFiles/clubb_lapack_double.dir/dsteqr.f.o
[610/927] Building Fortran object src/Lapack/Lapack_double/CMakeFiles/clubb_lapack_double.dir/dtrmm.f.o
[611/927] Building Fortran object src/Lapack/Lapack_double/CMakeFiles/clubb_lapack_double.dir/dtrsm.f.o
[612/927] Linking Fortran static library src/Lapack/liblapack_lib.a
[613/927] Generating Fortran dyndep file src/CLUBB_core/CMakeFiles/clubb_core_lib.dir/Fortran.dd
[614/927] Building Fortran object src/CLUBB_core/CMakeFiles/clubb_core_lib.dir/parameter_indices.F90.o
[615/927] Building Fortran object src/CLUBB_core/CMakeFiles/clubb_core_lib.dir/clubb_precision.F90.o
[616/927] Building Fortran object src/CLUBB_core/CMakeFiles/clubb_core_lib.dir/array_index.F90.o
[617/927] Building Fortran object src/CLUBB_core/CMakeFiles/clubb_core_lib.dir/error_code.F90.o
[618/927] Building Fortran object src/CLUBB_core/CMakeFiles/clubb_core_lib.dir/constants_clubb.F90.o
[619/927] Building Fortran object src/CLUBB_core/CMakeFiles/clubb_core_lib.dir/endian.F90.o
/home/jenkins/workspace/run_bindiff_w_varying_flags_against_master/bindiff_against_master/origin_readiopdata_merge2/clubb/src/CLUBB_core/endian.F90:167:53:

  167 |     call mvbits( i_element, 56, 8, i_element_br, 0  )
      |                                                     ^
Warning: 'i_element_br' is used uninitialized [-Wuninitialized]
/home/jenkins/workspace/run_bindiff_w_varying_flags_against_master/bindiff_against_master/origin_readiopdata_merge2/clubb/src/CLUBB_core/endian.F90:159:39:

  159 |     integer(kind=int64) :: i_element_br
      |                                       ^
note: 'i_element_br' declared here
/home/jenkins/workspace/run_bindiff_w_varying_flags_against_master/bindiff_against_master/origin_readiopdata_merge2/clubb/src/CLUBB_core/endian.F90:123:53:

  123 |     CALL MVBITS( i_element, 24, 8, i_element_br, 0  )
      |                                                     ^
Warning: 'i_element_br' is used uninitialized [-Wuninitialized]
/home/jenkins/workspace/run_bindiff_w_varying_flags_against_master/bindiff_against_master/origin_readiopdata_merge2/clubb/src/CLUBB_core/endian.F90:117:69:

  117 |     INTEGER(KIND=int32)                               :: i_element_br
      |                                                                     ^
note: 'i_element_br' declared here
[620/927] Building Fortran object src/CLUBB_core/CMakeFiles/clubb_core_lib.dir/lapack_interfaces.F90.o
[621/927] Building Fortran object src/CLUBB_core/CMakeFiles/clubb_core_lib.dir/Nc_Ncn_eqns.F90.o
[622/927] Building Fortran object src/CLUBB_core/CMakeFiles/clubb_core_lib.dir/T_in_K_module.F90.o
[623/927] Building Fortran object src/CLUBB_core/CMakeFiles/clubb_core_lib.dir/calendar.F90.o
[624/927] Building Fortran object src/CLUBB_core/CMakeFiles/clubb_core_lib.dir/LY93_pdf.F90.o
[625/927] Building Fortran object src/CLUBB_core/CMakeFiles/clubb_core_lib.dir/file_functions.F90.o
[626/927] Building Fortran object src/CLUBB_core/CMakeFiles/clubb_core_lib.dir/calc_roots.F90.o
[627/927] Building Fortran object src/CLUBB_core/CMakeFiles/clubb_core_lib.dir/hydromet_pdf_parameter_module.F90.o
[628/927] Building Fortran object src/CLUBB_core/CMakeFiles/clubb_core_lib.dir/new_hybrid_pdf.F90.o
[629/927] Building Fortran object src/CLUBB_core/CMakeFiles/clubb_core_lib.dir/mean_adv.F90.o
[630/927] Building Fortran object src/CLUBB_core/CMakeFiles/clubb_core_lib.dir/err_info_type_module.F90.o
[631/927] Building Fortran object src/CLUBB_core/CMakeFiles/clubb_core_lib.dir/new_tsdadg_pdf.F90.o
[632/927] Building Fortran object src/CLUBB_core/CMakeFiles/clubb_core_lib.dir/diagnose_correlations_module.F90.o
[633/927] Building Fortran object src/CLUBB_core/CMakeFiles/clubb_core_lib.dir/tridiag_lu_solver.F90.o
[634/927] Building Fortran object src/CLUBB_core/CMakeFiles/clubb_core_lib.dir/penta_lu_solver.F90.o
[635/927] Building Fortran object src/CLUBB_core/CMakeFiles/clubb_core_lib.dir/model_flags.F90.o
[636/927] Building Fortran object src/CLUBB_core/CMakeFiles/clubb_core_lib.dir/matrix_operations.F90.o
[637/927] Building Fortran object src/CLUBB_core/CMakeFiles/clubb_core_lib.dir/code_timer_module.F90.o
[638/927] Building Fortran object src/CLUBB_core/CMakeFiles/clubb_core_lib.dir/Skx_module.F90.o
[639/927] Building Fortran object src/CLUBB_core/CMakeFiles/clubb_core_lib.dir/interpolation.F90.o
[640/927] Building Fortran object src/CLUBB_core/CMakeFiles/clubb_core_lib.dir/penta_bicgstab_solver.F90.o
/home/jenkins/workspace/run_bindiff_w_varying_flags_against_master/bindiff_against_master/origin_readiopdata_merge2/clubb/src/CLUBB_core/penta_bicgstab_solver.F90:140:10:

  140 |       if ( norm_rhs == 0.0) then
      |          1
Warning: Equality comparison for REAL(8) at (1) [-Wcompare-reals]
[641/927] Building Fortran object src/CLUBB_core/CMakeFiles/clubb_core_lib.dir/corr_varnce_module.F90.o
[642/927] Building Fortran object src/CLUBB_core/CMakeFiles/clubb_core_lib.dir/new_pdf.F90.o
[643/927] Building Fortran object src/CLUBB_core/CMakeFiles/clubb_core_lib.dir/index_mapping.F90.o
[644/927] Building Fortran object src/CLUBB_core/CMakeFiles/clubb_core_lib.dir/adg1_adg2_3d_luhar_pdf.F90.o
[645/927] Building Fortran object src/CLUBB_core/CMakeFiles/clubb_core_lib.dir/lapack_wrap.F90.o
[646/927] Building Fortran object src/CLUBB_core/CMakeFiles/clubb_core_lib.dir/grid_class.F90.o
[647/927] Building Fortran object src/CLUBB_core/CMakeFiles/clubb_core_lib.dir/matrix_solver_wrapper.F90.o
[648/927] Building Fortran object src/CLUBB_core/CMakeFiles/clubb_core_lib.dir/sigma_sqd_w_module.F90.o
[649/927] Building Fortran object src/CLUBB_core/CMakeFiles/clubb_core_lib.dir/calc_pressure.F90.o
[650/927] Building Fortran object src/CLUBB_core/CMakeFiles/clubb_core_lib.dir/pos_definite_module.F90.o
[651/927] Building Fortran object src/CLUBB_core/CMakeFiles/clubb_core_lib.dir/sponge_layer_damping.F90.o
[652/927] Building Fortran object src/CLUBB_core/CMakeFiles/clubb_core_lib.dir/turbulent_adv_pdf.F90.o
[653/927] Building Fortran object src/CLUBB_core/CMakeFiles/clubb_core_lib.dir/diffusion.F90.o
[654/927] Building Fortran object src/CLUBB_core/CMakeFiles/clubb_core_lib.dir/saturation.F90.o
[655/927] Building Fortran object src/CLUBB_core/CMakeFiles/clubb_core_lib.dir/remapping_module.F90.o
/home/jenkins/workspace/run_bindiff_w_varying_flags_against_master/bindiff_against_master/origin_readiopdata_merge2/clubb/src/CLUBB_core/remapping_module.F90:1210:43:

 1210 |             if(f(i,k+1)*f(i,k-1)<zero .and. df2(i,k)/=zero) then
      |                                           1
Warning: Inequality comparison for REAL(8) at (1) [-Wcompare-reals]
/home/jenkins/workspace/run_bindiff_w_varying_flags_against_master/bindiff_against_master/origin_readiopdata_merge2/clubb/src/CLUBB_core/remapping_module.F90:1104:15:

 1104 |             if(dm(i) == zero) then
      |               1
Warning: Equality comparison for REAL(8) at (1) [-Wcompare-reals]
/home/jenkins/workspace/run_bindiff_w_varying_flags_against_master/bindiff_against_master/origin_readiopdata_merge2/clubb/src/CLUBB_core/remapping_module.F90:185:71:

  185 |                               *( val_below + lin_spline_rho_vals(l) )/2
      |                                                                       ^
Warning: 'level_below' may be used uninitialized [-Wmaybe-uninitialized]
/home/jenkins/workspace/run_bindiff_w_varying_flags_against_master/bindiff_against_master/origin_readiopdata_merge2/clubb/src/CLUBB_core/remapping_module.F90:129:17:

  129 |       level_below, &        ! The altitude of the level or spline connection point below   [m]
      |                 ^
note: 'level_below' was declared here
/home/jenkins/workspace/run_bindiff_w_varying_flags_against_master/bindiff_against_master/origin_readiopdata_merge2/clubb/src/CLUBB_core/remapping_module.F90:185:71:

  185 |                               *( val_below + lin_spline_rho_vals(l) )/2
      |                                                                       ^
Warning: 'val_below' may be used uninitialized [-Wmaybe-uninitialized]
/home/jenkins/workspace/run_bindiff_w_varying_flags_against_master/bindiff_against_master/origin_readiopdata_merge2/clubb/src/CLUBB_core/remapping_module.F90:128:15:

  128 |       val_below, &          ! The rho value of the level or spline connection point below  [kg/m^3]
      |               ^
note: 'val_below' was declared here
[656/927] Building Fortran object src/CLUBB_core/CMakeFiles/clubb_core_lib.dir/parameters_tunable.F90.o
/home/jenkins/workspace/run_bindiff_w_varying_flags_against_master/bindiff_against_master/origin_readiopdata_merge2/clubb/src/CLUBB_core/parameters_tunable.F90:1822:30:

 1822 |   subroutine unpack_parameters &
      |                              ^
Warning: 'unpack_parameters' defined but not used [-Wunused-function]
[657/927] Building Fortran object src/CLUBB_core/CMakeFiles/clubb_core_lib.dir/pdf_parameter_module.F90.o
[658/927] Building Fortran object src/CLUBB_core/CMakeFiles/clubb_core_lib.dir/new_hybrid_pdf_main.F90.o
[659/927] Building Fortran object src/CLUBB_core/CMakeFiles/clubb_core_lib.dir/new_pdf_main.F90.o
[660/927] Building Fortran object src/CLUBB_core/CMakeFiles/clubb_core_lib.dir/stats_netcdf.F90.o
[661/927] Building Fortran object src/CLUBB_core/CMakeFiles/clubb_core_lib.dir/advance_xp3_module.F90.o
[662/927] Building Fortran object src/CLUBB_core/CMakeFiles/clubb_core_lib.dir/precipitation_fraction.F90.o
[663/927] Building Fortran object src/CLUBB_core/CMakeFiles/clubb_core_lib.dir/mono_flux_limiter.F90.o
[664/927] Building Fortran object src/CLUBB_core/CMakeFiles/clubb_core_lib.dir/advance_helper_module.F90.o
[665/927] Building Fortran object src/CLUBB_core/CMakeFiles/clubb_core_lib.dir/pdf_utilities.F90.o
[666/927] Building Fortran object src/CLUBB_core/CMakeFiles/clubb_core_lib.dir/fill_holes.F90.o
[667/927] Building Fortran object src/CLUBB_core/CMakeFiles/clubb_core_lib.dir/numerical_check.F90.o
[668/927] Building Fortran object src/CLUBB_core/CMakeFiles/clubb_core_lib.dir/clip_explicit.F90.o
[669/927] Building Fortran object src/CLUBB_core/CMakeFiles/clubb_core_lib.dir/sfc_varnce_module.F90.o
[670/927] Building Fortran object src/CLUBB_core/CMakeFiles/clubb_core_lib.dir/mixing_length.F90.o
/home/jenkins/workspace/run_bindiff_w_varying_flags_against_master/bindiff_against_master/origin_readiopdata_merge2/clubb/src/CLUBB_core/mixing_length.F90:1096:16:

 1096 |             if ( abs( dCAPE_dz_j - dCAPE_dz_j_minus_1 ) * 2 <= &
      |                ^
Warning: 'dcape_dz_j' may be used uninitialized [-Wmaybe-uninitialized]
/home/jenkins/workspace/run_bindiff_w_varying_flags_against_master/bindiff_against_master/origin_readiopdata_merge2/clubb/src/CLUBB_core/mixing_length.F90:730:42:

  730 |     real( kind = core_rknd ) :: dCAPE_dz_j, dCAPE_dz_j_minus_1, dCAPE_dz_j_plus_1
      |                                          ^
note: 'dcape_dz_j' was declared here
[671/927] Building Fortran object src/CLUBB_core/CMakeFiles/clubb_core_lib.dir/advance_windm_edsclrm_module.F90.o
[672/927] Building Fortran object src/CLUBB_core/CMakeFiles/clubb_core_lib.dir/stats_clubb_utilities.F90.o
[673/927] Building Fortran object src/CLUBB_core/CMakeFiles/clubb_core_lib.dir/grid_adaptation_module.F90.o
[674/927] Building Fortran object src/CLUBB_core/CMakeFiles/clubb_core_lib.dir/setup_clubb_pdf_params.F90.o
[675/927] Building Fortran object src/CLUBB_core/CMakeFiles/clubb_core_lib.dir/advance_wp2_wp3_module.F90.o
/home/jenkins/workspace/run_bindiff_w_varying_flags_against_master/bindiff_against_master/origin_readiopdata_merge2/clubb/src/CLUBB_core/advance_wp2_wp3_module.F90:1918:12:

 1918 |         if ( abs(wp2_avg_before - wp2_avg_after) > epsilon(wp2_avg_after)*1000 ) then
      |            ^
Warning: 'wp2_avg_before' may be used uninitialized [-Wmaybe-uninitialized]
/home/jenkins/workspace/run_bindiff_w_varying_flags_against_master/bindiff_against_master/origin_readiopdata_merge2/clubb/src/CLUBB_core/advance_wp2_wp3_module.F90:1470:20:

 1470 |       wp2_avg_before, &
      |                    ^
note: 'wp2_avg_before' was declared here
[676/927] Building Fortran object src/CLUBB_core/CMakeFiles/clubb_core_lib.dir/advance_xp2_xpyp_module.F90.o
[677/927] Building Fortran object src/CLUBB_core/CMakeFiles/clubb_core_lib.dir/pdf_closure_module.F90.o
[678/927] Building Fortran object src/CLUBB_core/CMakeFiles/clubb_core_lib.dir/advance_xm_wpxp_module.F90.o
[679/927] Building Fortran object src/CLUBB_core/CMakeFiles/clubb_core_lib.dir/advance_clubb_core_module.F90.o
[680/927] Building Fortran object src/CLUBB_core/CMakeFiles/clubb_core_lib.dir/clubb_api_module.F90.o
[681/927] Linking Fortran static library src/CLUBB_core/libclubb_core_lib.a
[682/927] Generating Fortran dyndep file src/Radiation/BUGSrad/CMakeFiles/bugsrad_lib.dir/Fortran.dd
[683/927] Generating Fortran dyndep file src/CMakeFiles/text_writer_lib.dir/Fortran.dd
[684/927] Generating Fortran dyndep file src/Microphys/Microphys_utils/CMakeFiles/microphys_utils_lib.dir/Fortran.dd
[685/927] Generating Fortran dyndep file src/Microphys/COAMPS_microphys/CMakeFiles/coamps_lib.dir/Fortran.dd
[686/927] Building Fortran object src/Radiation/BUGSrad/CMakeFiles/bugsrad_lib.dir/kinds.F90.o
[687/927] Building Fortran object src/Microphys/COAMPS_microphys/CMakeFiles/coamps_lib.dir/eqa21.F.o
[688/927] Building Fortran object src/Microphys/COAMPS_microphys/CMakeFiles/coamps_lib.dir/eqa22.F.o
[689/927] Building Fortran object src/Microphys/COAMPS_microphys/CMakeFiles/coamps_lib.dir/eqa15.F.o
[690/927] Building Fortran object src/Microphys/COAMPS_microphys/CMakeFiles/coamps_lib.dir/eqa21g.F.o
[691/927] Building Fortran object src/Microphys/COAMPS_microphys/CMakeFiles/coamps_lib.dir/eqa20g.F.o
[692/927] Building Fortran object src/Microphys/COAMPS_microphys/CMakeFiles/coamps_lib.dir/eqa19.F.o
[693/927] Building Fortran object src/Microphys/COAMPS_microphys/CMakeFiles/coamps_lib.dir/eqa22g.F.o
[694/927] Building Fortran object src/Microphys/COAMPS_microphys/CMakeFiles/coamps_lib.dir/eqa28.F.o
[695/927] Building Fortran object src/Microphys/COAMPS_microphys/CMakeFiles/coamps_lib.dir/eqa18g.F.o
[696/927] Building Fortran object src/Microphys/COAMPS_microphys/CMakeFiles/coamps_lib.dir/eqa26.F.o
[697/927] Building Fortran object src/Microphys/COAMPS_microphys/CMakeFiles/coamps_lib.dir/eqa27.F.o
[698/927] Building Fortran object src/Microphys/COAMPS_microphys/CMakeFiles/coamps_lib.dir/eqa27r.F.o
[699/927] Building Fortran object src/Microphys/COAMPS_microphys/CMakeFiles/coamps_lib.dir/eqa25.F.o
[700/927] Building Fortran object src/Microphys/COAMPS_microphys/CMakeFiles/coamps_lib.dir/eqa10g.F.o
[701/927] Building Fortran object src/Microphys/COAMPS_microphys/CMakeFiles/coamps_lib.dir/eqa12g.F.o
[702/927] Building Fortran object src/Radiation/BUGSrad/CMakeFiles/bugsrad_lib.dir/bugsrad_physconst.F90.o
[703/927] Building Fortran object src/Microphys/COAMPS_microphys/CMakeFiles/coamps_lib.dir/eqa14g.F.o
[704/927] Building Fortran object src/Microphys/COAMPS_microphys/CMakeFiles/coamps_lib.dir/eqa19g.F.o
[705/927] Building Fortran object src/Microphys/COAMPS_microphys/CMakeFiles/coamps_lib.dir/eqa13g.F.o
[706/927] Building Fortran object src/Microphys/COAMPS_microphys/CMakeFiles/coamps_lib.dir/eqa7g.F.o
[707/927] Building Fortran object src/Microphys/COAMPS_microphys/CMakeFiles/coamps_lib.dir/eqa17g.F.o
[708/927] Building Fortran object src/Microphys/COAMPS_microphys/CMakeFiles/coamps_lib.dir/eqa6.F.o
[709/927] Building Fortran object src/Microphys/COAMPS_microphys/CMakeFiles/coamps_lib.dir/eqa11g.F.o
[710/927] Building Fortran object src/Microphys/COAMPS_microphys/CMakeFiles/coamps_lib.dir/eqa18.F.o
[711/927] Building Fortran object src/Microphys/COAMPS_microphys/CMakeFiles/coamps_lib.dir/eqa7.F.o
[712/927] Building Fortran object src/Radiation/BUGSrad/CMakeFiles/bugsrad_lib.dir/newexp.F90.o
[713/927] Building Fortran object src/Microphys/COAMPS_microphys/CMakeFiles/coamps_lib.dir/eqa5g.F.o
[714/927] Building Fortran object src/Radiation/BUGSrad/CMakeFiles/bugsrad_lib.dir/comscp2.F.o
[715/927] Building Fortran object src/CMakeFiles/text_writer_lib.dir/text_writer.F90.o
[716/927] Building Fortran object src/Radiation/BUGSrad/CMakeFiles/bugsrad_lib.dir/rayle.F.o
[717/927] Building Fortran object src/Radiation/BUGSrad/CMakeFiles/bugsrad_lib.dir/comscp1.F.o
[718/927] Building Fortran object src/Radiation/BUGSrad/CMakeFiles/bugsrad_lib.dir/bugsrad_planck.F90.o
[719/927] Building Fortran object src/Microphys/COAMPS_microphys/CMakeFiles/coamps_lib.dir/esati.F.o
[720/927] Building Fortran object src/Microphys/COAMPS_microphys/CMakeFiles/coamps_lib.dir/adjmlt.F.o
[721/927] Building Fortran object src/Microphys/COAMPS_microphys/CMakeFiles/coamps_lib.dir/eqa12.F.o
[722/927] Building Fortran object src/Microphys/COAMPS_microphys/CMakeFiles/coamps_lib.dir/esatv.F.o
[723/927] Building Fortran object src/Microphys/Microphys_utils/CMakeFiles/microphys_utils_lib.dir/microphys_stats_vars_module.F90.o
[724/927] Building Fortran object src/Microphys/COAMPS_microphys/CMakeFiles/coamps_lib.dir/frzh.F.o
[725/927] Building Fortran object src/Microphys/COAMPS_microphys/CMakeFiles/coamps_lib.dir/gamma.F.o
[726/927] Building Fortran object src/Microphys/COAMPS_microphys/CMakeFiles/coamps_lib.dir/eqa8g.F.o
[727/927] Building Fortran object src/Radiation/BUGSrad/CMakeFiles/bugsrad_lib.dir/two_rt_lw_sel.F.o
[728/927] Building Fortran object src/Microphys/COAMPS_microphys/CMakeFiles/coamps_lib.dir/eqa9g.F.o
[729/927] Building Fortran object src/Microphys/COAMPS_microphys/CMakeFiles/coamps_lib.dir/eqa9.F.o
[730/927] Building Fortran object src/Radiation/BUGSrad/CMakeFiles/bugsrad_lib.dir/gascon.F.o
[731/927] Building Fortran object src/Microphys/COAMPS_microphys/CMakeFiles/coamps_lib.dir/esat_new.F.o
[732/927] Building Fortran object src/Microphys/COAMPS_microphys/CMakeFiles/coamps_lib.dir/qsatvi.F.o
[733/927] Building Fortran object src/Microphys/COAMPS_microphys/CMakeFiles/coamps_lib.dir/tgqg.F.o
[734/927] Building Fortran object src/Microphys/COAMPS_microphys/CMakeFiles/coamps_lib.dir/nrmtqi.F.o
[735/927] Linking Fortran static library src/libtext_writer_lib.a
[736/927] Building Fortran object src/Microphys/COAMPS_microphys/CMakeFiles/coamps_lib.dir/tgqs.F.o
[737/927] Building Fortran object src/Microphys/COAMPS_microphys/CMakeFiles/coamps_lib.dir/conice.F.o
[738/927] Building Fortran object src/Microphys/COAMPS_microphys/CMakeFiles/coamps_lib.dir/tgqi.F.o
[739/927] Building Fortran object src/Microphys/COAMPS_microphys/CMakeFiles/coamps_lib.dir/slope.F.o
[740/927] Building Fortran object src/Radiation/BUGSrad/CMakeFiles/bugsrad_lib.dir/cloudg.F.o
[741/927] Building Fortran object src/Microphys/COAMPS_microphys/CMakeFiles/coamps_lib.dir/tgqr.F.o
[742/927] Building Fortran object src/Microphys/COAMPS_microphys/CMakeFiles/coamps_lib.dir/qtadj.F.o
[743/927] Building Fortran object src/Microphys/COAMPS_microphys/CMakeFiles/coamps_lib.dir/nrmcol.F.o
[744/927] Building Fortran object src/Radiation/BUGSrad/CMakeFiles/bugsrad_lib.dir/two_rt_lw.F.o
[745/927] Linking Fortran static library src/Microphys/Microphys_utils/libmicrophys_utils_lib.a
[746/927] Generating Fortran dyndep file src/Microphys/KK_microphys/CMakeFiles/KK_microphys_lib.dir/Fortran.dd
[747/927] Building Fortran object src/Microphys/COAMPS_microphys/CMakeFiles/coamps_lib.dir/nrmtqw.F.o
[748/927] Generating Fortran dyndep file src/Microphys/Morrison_microphys/CMakeFiles/morrison_microphys_lib.dir/Fortran.dd
[749/927] Building Fortran object src/Radiation/BUGSrad/CMakeFiles/bugsrad_lib.dir/two_rt_sw.F.o
[750/927] Building Fortran object src/Microphys/KK_microphys/CMakeFiles/KK_microphys_lib.dir/Parabolic_constants.f90.o
[751/927] Building Fortran object src/Microphys/KK_microphys/CMakeFiles/KK_microphys_lib.dir/parameters_KK.F90.o
[752/927] Building Fortran object src/Radiation/BUGSrad/CMakeFiles/bugsrad_lib.dir/cloud_correlate.F90.o
[753/927] Building Fortran object src/Radiation/BUGSrad/CMakeFiles/bugsrad_lib.dir/two_rt_lw_iter.F.o
[754/927] Building Fortran object src/Microphys/KK_microphys/CMakeFiles/KK_microphys_lib.dir/KK_local_means.F90.o
[755/927] Building Fortran object src/Radiation/BUGSrad/CMakeFiles/bugsrad_lib.dir/two_rt_sw_iter.F.o
[756/927] Building Fortran object src/Radiation/BUGSrad/CMakeFiles/bugsrad_lib.dir/two_rt_sw_bs.F.o
[757/927] Building Fortran object src/Radiation/BUGSrad/CMakeFiles/bugsrad_lib.dir/two_rt_lw_ocastrndm.F90.o
[758/927] Building Fortran object src/Radiation/BUGSrad/CMakeFiles/bugsrad_lib.dir/two_rt_sw_ocastrndm.F90.o
[759/927] Building Fortran object src/Microphys/KK_microphys/CMakeFiles/KK_microphys_lib.dir/AiryFunction.f90.o
[760/927] Building Fortran object src/Microphys/COAMPS_microphys/CMakeFiles/coamps_lib.dir/adjtq.F.o
[761/927] Building Fortran object src/Radiation/BUGSrad/CMakeFiles/bugsrad_lib.dir/gases_ckd.F90.o
[762/927] Linking Fortran static library src/Microphys/COAMPS_microphys/libcoamps_lib.a
[763/927] Building Fortran object src/Radiation/BUGSrad/CMakeFiles/bugsrad_lib.dir/bugs_rad.F.o
[764/927] Building Fortran object src/Radiation/BUGSrad/CMakeFiles/bugsrad_lib.dir/bugs_lwr.F.o
[765/927] Building Fortran object src/Radiation/BUGSrad/CMakeFiles/bugsrad_lib.dir/bugs_swr.F.o
[766/927] Linking Fortran static library src/Radiation/BUGSrad/libbugsrad_lib.a
[767/927] Building Fortran object src/Microphys/KK_microphys/CMakeFiles/KK_microphys_lib.dir/Parabolic.f90.o
[768/927] Building Fortran object src/Microphys/KK_microphys/CMakeFiles/KK_microphys_lib.dir/KK_utilities.F90.o
[769/927] Building Fortran object src/Microphys/KK_microphys/CMakeFiles/KK_microphys_lib.dir/PDF_integrals_means.F90.o
[770/927] Building Fortran object src/Microphys/KK_microphys/CMakeFiles/KK_microphys_lib.dir/PDF_integrals_covar.F90.o
[771/927] Building Fortran object src/Microphys/KK_microphys/CMakeFiles/KK_microphys_lib.dir/PDF_integrals_all_MM.F90.o
[772/927] Building Fortran object src/Microphys/KK_microphys/CMakeFiles/KK_microphys_lib.dir/KK_upscaled_means.F90.o
[773/927] Building Fortran object src/Microphys/KK_microphys/CMakeFiles/KK_microphys_lib.dir/KK_upscaled_variances.F90.o
[774/927] Building Fortran object src/Microphys/KK_microphys/CMakeFiles/KK_microphys_lib.dir/KK_Nrm_tendencies.F90.o
[775/927] Building Fortran object src/Microphys/KK_microphys/CMakeFiles/KK_microphys_lib.dir/KK_upscaled_turbulent_sed.F90.o
[776/927] Building Fortran object src/Microphys/KK_microphys/CMakeFiles/KK_microphys_lib.dir/KK_upscaled_covariances.F90.o
[777/927] Linking Fortran static library src/Microphys/KK_microphys/libKK_microphys_lib.a
[778/927] Generating Fortran dyndep file src/SILHS/CMakeFiles/silhs_lib.dir/Fortran.dd
[779/927] Building Fortran object src/SILHS/CMakeFiles/silhs_lib.dir/latin_hypercube_arrays.F90.o
[780/927] Building Fortran object src/SILHS/CMakeFiles/silhs_lib.dir/parameters_silhs.F90.o
[781/927] Building Fortran object src/SILHS/CMakeFiles/silhs_lib.dir/est_kessler_microphys_module.F90.o
[782/927] Building Fortran object src/SILHS/CMakeFiles/silhs_lib.dir/transform_to_pdf_module.F90.o
[783/927] Building Fortran object src/SILHS/CMakeFiles/silhs_lib.dir/mt95.F90.o
[784/927] Building Fortran object src/SILHS/CMakeFiles/silhs_lib.dir/generate_uniform_sample_module.F90.o
[785/927] Building Fortran object src/SILHS/CMakeFiles/silhs_lib.dir/math_utilities.F90.o
[786/927] Building Fortran object src/SILHS/CMakeFiles/silhs_lib.dir/lh_microphys_var_covar_module.F90.o
[787/927] Building Fortran object src/SILHS/CMakeFiles/silhs_lib.dir/silhs_importance_sample_module.F90.o
/home/jenkins/workspace/run_bindiff_w_varying_flags_against_master/bindiff_against_master/origin_readiopdata_merge2/clubb/src/SILHS/silhs_importance_sample_module.F90:638:62:

  633 |       do category=1, num_importance_categories
      |                                              2                
......
  638 |                rand_vect(sample) <  category_cumulative_probs(category+1) ) then
      |                                                              1
Warning: Array reference at (1) out of bounds (9 > 8) in loop beginning at (2) [-Wdo-subscript]
[788/927] Building Fortran object src/Microphys/Morrison_microphys/CMakeFiles/morrison_microphys_lib.dir/module_mp_graupel.F90.o
[789/927] Linking Fortran static library src/Microphys/Morrison_microphys/libmorrison_microphys_lib.a
[790/927] Building Fortran object src/SILHS/CMakeFiles/silhs_lib.dir/latin_hypercube_driver_module.F90.o
/home/jenkins/workspace/run_bindiff_w_varying_flags_against_master/bindiff_against_master/origin_readiopdata_merge2/clubb/src/SILHS/latin_hypercube_driver_module.F90:1595:10:

 1595 |       if ( X_u_chi(sample) < (one - cloud_frac_i) ) then
      |          ^
Warning: 'cloud_frac_i' may be used uninitialized [-Wmaybe-uninitialized]
/home/jenkins/workspace/run_bindiff_w_varying_flags_against_master/bindiff_against_master/origin_readiopdata_merge2/clubb/src/SILHS/latin_hypercube_driver_module.F90:1577:18:

 1577 |       cloud_frac_i
      |                  ^
note: 'cloud_frac_i' was declared here
[791/927] Building Fortran object src/SILHS/CMakeFiles/silhs_lib.dir/silhs_api_module.F90.o
[792/927] Linking Fortran static library src/SILHS/libsilhs_lib.a
[793/927] Generating Fortran dyndep file src/Radiation/CMakeFiles/radiation_lib.dir/Fortran.dd
[794/927] Generating Fortran dyndep file src/Numerical_recipes/CMakeFiles/numerical_recipes_lib.dir/Fortran.dd
[795/927] Building Fortran object src/Radiation/CMakeFiles/radiation_lib.dir/parameters_radiation.F90.o
[796/927] Building Fortran object src/Radiation/CMakeFiles/radiation_lib.dir/cos_solar_zen_module.F90.o
[797/927] Building Fortran object src/Numerical_recipes/CMakeFiles/numerical_recipes_lib.dir/nrtype.f90.o
[798/927] Building Fortran object src/Radiation/CMakeFiles/radiation_lib.dir/soil_vegetation.F90.o
[799/927] Building Fortran object src/Numerical_recipes/CMakeFiles/numerical_recipes_lib.dir/quicksort.F90.o
[800/927] Building Fortran object src/Numerical_recipes/CMakeFiles/numerical_recipes_lib.dir/nr.f90.o
[801/927] Building Fortran object src/Radiation/CMakeFiles/radiation_lib.dir/rad_lwsw_module.F90.o
[802/927] Building Fortran object src/Radiation/CMakeFiles/radiation_lib.dir/extended_atmosphere_module.F90.o
[803/927] Building Fortran object src/Radiation/CMakeFiles/radiation_lib.dir/simple_rad_module.F90.o
[804/927] Building Fortran object src/Numerical_recipes/CMakeFiles/numerical_recipes_lib.dir/enhanced_simann.F90.o
[805/927] Building Fortran object src/Radiation/CMakeFiles/radiation_lib.dir/radiation_variables_module.F90.o
[806/927] Building Fortran object src/Numerical_recipes/CMakeFiles/numerical_recipes_lib.dir/nrutil.f90.o
[807/927] Building Fortran object src/Numerical_recipes/CMakeFiles/numerical_recipes_lib.dir/amoeba.f90.o
[808/927] Building Fortran object src/Numerical_recipes/CMakeFiles/numerical_recipes_lib.dir/amebsa.f90.o
[809/927] Building Fortran object src/Numerical_recipes/CMakeFiles/numerical_recipes_lib.dir/ran_state.f90.o
/home/jenkins/workspace/run_bindiff_w_varying_flags_against_master/bindiff_against_master/origin_readiopdata_merge2/clubb/src/Numerical_recipes/ran_state.f90:8:59:

    8 |   INTEGER(K4B), PARAMETER :: hg=huge(1_K4B), hgm=-hg, hgng=hgm-1
      |                                                           1
Warning: Integer outside symmetric range implied by Standard Fortran at (1)
[810/927] Building Fortran object src/Numerical_recipes/CMakeFiles/numerical_recipes_lib.dir/ran1_s.f90.o
[811/927] Building Fortran object src/Numerical_recipes/CMakeFiles/numerical_recipes_lib.dir/ran1_v.f90.o
[812/927] Linking Fortran static library src/Numerical_recipes/libnumerical_recipes_lib.a
[813/927] Building Fortran object src/Radiation/CMakeFiles/radiation_lib.dir/bugsrad_driver.F90.o
[814/927] Building Fortran object src/Radiation/CMakeFiles/radiation_lib.dir/radiation_module.F90.o
[815/927] Linking Fortran static library src/Radiation/libradiation_lib.a
[816/927] Generating Fortran dyndep file src/Input_fields/CMakeFiles/input_fields_lib.dir/Fortran.dd
[817/927] Building Fortran object src/Input_fields/CMakeFiles/input_fields_lib.dir/input_names.F90.o
[818/927] Building Fortran object src/Input_fields/CMakeFiles/input_fields_lib.dir/extrapolation.F90.o
[819/927] Building Fortran object src/Input_fields/CMakeFiles/input_fields_lib.dir/stat_file_module.F90.o
[820/927] Building Fortran object src/Input_fields/CMakeFiles/input_fields_lib.dir/hydrostatic_module.F90.o
[821/927] Building Fortran object src/Input_fields/CMakeFiles/input_fields_lib.dir/input_netcdf.F90.o
[822/927] Building Fortran object src/Input_fields/CMakeFiles/input_fields_lib.dir/input_reader.F90.o
/home/jenkins/workspace/run_bindiff_w_varying_flags_against_master/bindiff_against_master/origin_readiopdata_merge2/clubb/src/Input_fields/input_reader.F90:498:28:

  491 |     do i=1, dim_grid
      |                    2        
......
  498 |         if ( grid(i) < grid(i-1) ) then
      |                            1
Warning: Array reference at (1) out of bounds (0 < 1) in loop beginning at (2) [-Wdo-subscript]
[823/927] Building Fortran object src/Input_fields/CMakeFiles/input_fields_lib.dir/corr_varnce_input_reader.F90.o
[824/927] Building Fortran object src/Input_fields/CMakeFiles/input_fields_lib.dir/input_interpret.F90.o
[825/927] Building Fortran object src/Input_fields/CMakeFiles/input_fields_lib.dir/stat_file_utils.F90.o
[826/927] Building Fortran object src/Input_fields/CMakeFiles/input_fields_lib.dir/__/readiopdata_core/readiopdata_core_module.F90.o
/home/jenkins/workspace/run_bindiff_w_varying_flags_against_master/bindiff_against_master/origin_readiopdata_merge2/clubb/src/readiopdata_core/readiopdata_core_module.F90:1468:21:

 1468 |    if( (bmnth>2).and. isLeapYear(byear) ) jday = jday + 1
      |                     1
Warning: Impure function 'isleapyear' at (1) might not be evaluated [-Wfunction-elimination]
/home/jenkins/workspace/run_bindiff_w_varying_flags_against_master/bindiff_against_master/origin_readiopdata_merge2/clubb/src/readiopdata_core/readiopdata_core_module.F90:1490:18:

 1490 |       if(i==2.and.isLeapYear(iyear)) days_this_month = days_this_month + 1
      |                  1
Warning: Impure function 'isleapyear' at (1) might not be evaluated [-Wfunction-elimination]
/home/jenkins/workspace/run_bindiff_w_varying_flags_against_master/bindiff_against_master/origin_readiopdata_merge2/clubb/src/readiopdata_core/readiopdata_core_module.F90:1036:15:

 1036 |             if(divT_in(i,nlev+1)==missing_value) divT_in(i,nlev+1) = &
      |               1
Warning: Equality comparison for REAL(4) at (1) [-Wcompare-reals]
/home/jenkins/workspace/run_bindiff_w_varying_flags_against_master/bindiff_against_master/origin_readiopdata_merge2/clubb/src/readiopdata_core/readiopdata_core_module.F90:1038:15:

 1038 |             if(vertdivT_in(i,nlev+1)==missing_value) vertdivT_in(i,nlev+1) = &
      |               1
Warning: Equality comparison for REAL(4) at (1) [-Wcompare-reals]
/home/jenkins/workspace/run_bindiff_w_varying_flags_against_master/bindiff_against_master/origin_readiopdata_merge2/clubb/src/readiopdata_core/readiopdata_core_module.F90:1040:15:

 1040 |             if(divT3d_in(i,nlev+1)==missing_value) divT3d_in(i,nlev+1) = &
      |               1
Warning: Equality comparison for REAL(4) at (1) [-Wcompare-reals]
/home/jenkins/workspace/run_bindiff_w_varying_flags_against_master/bindiff_against_master/origin_readiopdata_merge2/clubb/src/readiopdata_core/readiopdata_core_module.F90:1043:15:

 1043 |             if(divq_in(i,nlev+1)==missing_value) divq_in(i,nlev+1) = &
      |               1
Warning: Equality comparison for REAL(4) at (1) [-Wcompare-reals]
/home/jenkins/workspace/run_bindiff_w_varying_flags_against_master/bindiff_against_master/origin_readiopdata_merge2/clubb/src/readiopdata_core/readiopdata_core_module.F90:1045:15:

 1045 |             if(vertdivq_in(i,nlev+1)==missing_value) vertdivq_in(i,nlev+1) = &
      |               1
Warning: Equality comparison for REAL(4) at (1) [-Wcompare-reals]
/home/jenkins/workspace/run_bindiff_w_varying_flags_against_master/bindiff_against_master/origin_readiopdata_merge2/clubb/src/readiopdata_core/readiopdata_core_module.F90:1047:15:

 1047 |             if(divq3d_in(i,nlev+1)==missing_value) divq3d_in(i,nlev+1) = &
      |               1
Warning: Equality comparison for REAL(4) at (1) [-Wcompare-reals]
/home/jenkins/workspace/run_bindiff_w_varying_flags_against_master/bindiff_against_master/origin_readiopdata_merge2/clubb/src/readiopdata_core/readiopdata_core_module.F90:354:13:

  354 |      if( ANY(Ts_in == 0.0) ) then
      |             1
Warning: Equality comparison for REAL(4) at (1) [-Wcompare-reals]
/home/jenkins/workspace/run_bindiff_w_varying_flags_against_master/bindiff_against_master/origin_readiopdata_merge2/clubb/src/readiopdata_core/readiopdata_core_module.F90:618:12:

  618 |          if(T_in(i,nlev+1)/=missing_value) then
      |            1
Warning: Inequality comparison for REAL(4) at (1) [-Wcompare-reals]
/home/jenkins/workspace/run_bindiff_w_varying_flags_against_master/bindiff_against_master/origin_readiopdata_merge2/clubb/src/readiopdata_core/readiopdata_core_module.F90:634:12:

  634 |          if(T_in(i,nlev+1)==missing_value) &
      |            1
Warning: Equality comparison for REAL(4) at (1) [-Wcompare-reals]
/home/jenkins/workspace/run_bindiff_w_varying_flags_against_master/bindiff_against_master/origin_readiopdata_merge2/clubb/src/readiopdata_core/readiopdata_core_module.F90:636:12:

  636 |          if(q_in(i,nlev+1)==missing_value) &
      |            1
Warning: Equality comparison for REAL(4) at (1) [-Wcompare-reals]
/home/jenkins/workspace/run_bindiff_w_varying_flags_against_master/bindiff_against_master/origin_readiopdata_merge2/clubb/src/readiopdata_core/readiopdata_core_module.F90:638:12:

  638 |          if(u_in(i,nlev+1)==missing_value) &
      |            1
Warning: Equality comparison for REAL(4) at (1) [-Wcompare-reals]
/home/jenkins/workspace/run_bindiff_w_varying_flags_against_master/bindiff_against_master/origin_readiopdata_merge2/clubb/src/readiopdata_core/readiopdata_core_module.F90:640:12:

  640 |          if(v_in(i,nlev+1)==missing_value) &
      |            1
Warning: Equality comparison for REAL(4) at (1) [-Wcompare-reals]
/home/jenkins/workspace/run_bindiff_w_varying_flags_against_master/bindiff_against_master/origin_readiopdata_merge2/clubb/src/readiopdata_core/readiopdata_core_module.F90:645:15:

  645 |             if(omega_in(i,nlev+1)==missing_value) omega_in(i,nlev+1) = &
      |               1
Warning: Equality comparison for REAL(4) at (1) [-Wcompare-reals]
/home/jenkins/workspace/run_bindiff_w_varying_flags_against_master/bindiff_against_master/origin_readiopdata_merge2/clubb/src/readiopdata_core/readiopdata_core_module.F90:649:15:

  649 |             if(w_in(i,nlev+1)==missing_value) w_in(i,nlev+1) = &
      |               1
Warning: Equality comparison for REAL(4) at (1) [-Wcompare-reals]
/home/jenkins/workspace/run_bindiff_w_varying_flags_against_master/bindiff_against_master/origin_readiopdata_merge2/clubb/src/readiopdata_core/readiopdata_core_module.F90:656:12:

  656 |          if(ug_in(i,nlev+1)==missing_value) &
      |            1
Warning: Equality comparison for REAL(4) at (1) [-Wcompare-reals]
/home/jenkins/workspace/run_bindiff_w_varying_flags_against_master/bindiff_against_master/origin_readiopdata_merge2/clubb/src/readiopdata_core/readiopdata_core_module.F90:658:12:

  658 |          if(vg_in(i,nlev+1)==missing_value) &
      |            1
Warning: Equality comparison for REAL(4) at (1) [-Wcompare-reals]
/home/jenkins/workspace/run_bindiff_w_varying_flags_against_master/bindiff_against_master/origin_readiopdata_merge2/clubb/src/readiopdata_core/readiopdata_core_module.F90:1250:42:

 1250 |   character     dim_name*( NF90_MAX_NAME )
      |                                          1
Warning: Unused variable 'dim_name' declared at (1) [-Wunused-variable]
/home/jenkins/workspace/run_bindiff_w_varying_flags_against_master/bindiff_against_master/origin_readiopdata_merge2/clubb/src/readiopdata_core/readiopdata_core_module.F90:1252:33:

 1252 |   integer     var_ndims, dim_size, dims_set, i, n, var_type
      |                                 1
Warning: Unused variable 'dim_size' declared at (1) [-Wunused-variable]
/home/jenkins/workspace/run_bindiff_w_varying_flags_against_master/bindiff_against_master/origin_readiopdata_merge2/clubb/src/readiopdata_core/readiopdata_core_module.F90:1252:43:

 1252 |   integer     var_ndims, dim_size, dims_set, i, n, var_type
      |                                           1
Warning: Unused variable 'dims_set' declared at (1) [-Wunused-variable]
/home/jenkins/workspace/run_bindiff_w_varying_flags_against_master/bindiff_against_master/origin_readiopdata_merge2/clubb/src/readiopdata_core/readiopdata_core_module.F90:1252:46:

 1252 |   integer     var_ndims, dim_size, dims_set, i, n, var_type
      |                                              1
Warning: Unused variable 'i' declared at (1) [-Wunused-variable]
/home/jenkins/workspace/run_bindiff_w_varying_flags_against_master/bindiff_against_master/origin_readiopdata_merge2/clubb/src/readiopdata_core/readiopdata_core_module.F90:1235:60:

 1235 | subroutine get_netcdf_var2d_real( NCID, varName, ntime, nlev, &
      |                                                            1
Warning: Unused dummy argument 'nlev' at (1) [-Wunused-dummy-argument]
/home/jenkins/workspace/run_bindiff_w_varying_flags_against_master/bindiff_against_master/origin_readiopdata_merge2/clubb/src/readiopdata_core/readiopdata_core_module.F90:1235:54:

 1235 | subroutine get_netcdf_var2d_real( NCID, varName, ntime, nlev, &
      |                                                      1
Warning: Unused dummy argument 'ntime' at (1) [-Wunused-dummy-argument]
/home/jenkins/workspace/run_bindiff_w_varying_flags_against_master/bindiff_against_master/origin_readiopdata_merge2/clubb/src/readiopdata_core/readiopdata_core_module.F90:1236:23:

 1236 |      var, use_NF90_REAL, status, required)
      |                       1
Warning: Unused dummy argument 'use_nf90_real' at (1) [-Wunused-dummy-argument]
/home/jenkins/workspace/run_bindiff_w_varying_flags_against_master/bindiff_against_master/origin_readiopdata_merge2/clubb/src/readiopdata_core/readiopdata_core_module.F90:1165:67:

 1165 | subroutine get_netcdf_var1d_real( NCID, varName, var, use_NF90_REAL, &
      |                                                                   1
Warning: Unused dummy argument 'use_nf90_real' at (1) [-Wunused-dummy-argument]
/home/jenkins/workspace/run_bindiff_w_varying_flags_against_master/bindiff_against_master/origin_readiopdata_merge2/clubb/src/readiopdata_core/readiopdata_core_module.F90:749:51:

  749 |                                get_add_surface_data, ntime, &
      |                                                   1
Warning: Unused dummy argument 'get_add_surface_data' at (1) [-Wunused-dummy-argument]
/home/jenkins/workspace/run_bindiff_w_varying_flags_against_master/bindiff_against_master/origin_readiopdata_merge2/clubb/src/readiopdata_core/readiopdata_core_module.F90:748:81:

  748 | subroutine readiopdata_core_sfc( masterproc, iopfilepath, scamiop_from_global_cam, SFC_FLX_FXD, &
      |                                                                                 1
Warning: Unused dummy argument 'scamiop_from_global_cam' at (1) [-Wunused-dummy-argument]
/home/jenkins/workspace/run_bindiff_w_varying_flags_against_master/bindiff_against_master/origin_readiopdata_merge2/clubb/src/readiopdata_core/readiopdata_core_module.F90:294:32:

  294 |    integer :: STATUS, i, n, nlat, nlon
      |                                1
Warning: Unused variable 'nlat' declared at (1) [-Wunused-variable]
/home/jenkins/workspace/run_bindiff_w_varying_flags_against_master/bindiff_against_master/origin_readiopdata_merge2/clubb/src/readiopdata_core/readiopdata_core_module.F90:294:38:

  294 |    integer :: STATUS, i, n, nlat, nlon
      |                                      1
Warning: Unused variable 'nlon' declared at (1) [-Wunused-variable]
/home/jenkins/workspace/run_bindiff_w_varying_flags_against_master/bindiff_against_master/origin_readiopdata_merge2/clubb/src/readiopdata_core/readiopdata_core_module.F90:295:19:

  295 |    integer :: varID, NCID
      |                   1
Warning: Unused variable 'varid' declared at (1) [-Wunused-variable]
/home/jenkins/workspace/run_bindiff_w_varying_flags_against_master/bindiff_against_master/origin_readiopdata_merge2/clubb/src/readiopdata_core/readiopdata_core_module.F90:784:28:

  784 |    shf_in(:) = missing_value
      |                            ^
Warning: 'shf_in.offset' may be used uninitialized [-Wmaybe-uninitialized]
/home/jenkins/workspace/run_bindiff_w_varying_flags_against_master/bindiff_against_master/origin_readiopdata_merge2/clubb/src/readiopdata_core/readiopdata_core_module.F90:759:34:

  759 |     real, allocatable :: shf_in(:), lhf_in(:), tausrf_in(:), tmp_srf(:), Tg_in(:)
      |                                  ^
note: 'shf_in' declared here
/home/jenkins/workspace/run_bindiff_w_varying_flags_against_master/bindiff_against_master/origin_readiopdata_merge2/clubb/src/readiopdata_core/readiopdata_core_module.F90:784:28:

  784 |    shf_in(:) = missing_value
      |                            ^
Warning: 'shf_in.dim[0].lbound' may be used uninitialized [-Wmaybe-uninitialized]
/home/jenkins/workspace/run_bindiff_w_varying_flags_against_master/bindiff_against_master/origin_readiopdata_merge2/clubb/src/readiopdata_core/readiopdata_core_module.F90:759:34:

  759 |     real, allocatable :: shf_in(:), lhf_in(:), tausrf_in(:), tmp_srf(:), Tg_in(:)
      |                                  ^
note: 'shf_in' declared here
/home/jenkins/workspace/run_bindiff_w_varying_flags_against_master/bindiff_against_master/origin_readiopdata_merge2/clubb/src/readiopdata_core/readiopdata_core_module.F90:784:28:

  784 |    shf_in(:) = missing_value
      |                            ^
Warning: 'shf_in.dim[0].ubound' may be used uninitialized [-Wmaybe-uninitialized]
/home/jenkins/workspace/run_bindiff_w_varying_flags_against_master/bindiff_against_master/origin_readiopdata_merge2/clubb/src/readiopdata_core/readiopdata_core_module.F90:759:34:

  759 |     real, allocatable :: shf_in(:), lhf_in(:), tausrf_in(:), tmp_srf(:), Tg_in(:)
      |                                  ^
note: 'shf_in' declared here
/home/jenkins/workspace/run_bindiff_w_varying_flags_against_master/bindiff_against_master/origin_readiopdata_merge2/clubb/src/readiopdata_core/readiopdata_core_module.F90:785:28:

  785 |    lhf_in(:) = missing_value
      |                            ^
Warning: 'lhf_in.offset' may be used uninitialized [-Wmaybe-uninitialized]
/home/jenkins/workspace/run_bindiff_w_varying_flags_against_master/bindiff_against_master/origin_readiopdata_merge2/clubb/src/readiopdata_core/readiopdata_core_module.F90:759:45:

  759 |     real, allocatable :: shf_in(:), lhf_in(:), tausrf_in(:), tmp_srf(:), Tg_in(:)
      |                                             ^
note: 'lhf_in' declared here
/home/jenkins/workspace/run_bindiff_w_varying_flags_against_master/bindiff_against_master/origin_readiopdata_merge2/clubb/src/readiopdata_core/readiopdata_core_module.F90:785:28:

  785 |    lhf_in(:) = missing_value
      |                            ^
Warning: 'lhf_in.dim[0].lbound' may be used uninitialized [-Wmaybe-uninitialized]
/home/jenkins/workspace/run_bindiff_w_varying_flags_against_master/bindiff_against_master/origin_readiopdata_merge2/clubb/src/readiopdata_core/readiopdata_core_module.F90:759:45:

  759 |     real, allocatable :: shf_in(:), lhf_in(:), tausrf_in(:), tmp_srf(:), Tg_in(:)
      |                                             ^
note: 'lhf_in' declared here
/home/jenkins/workspace/run_bindiff_w_varying_flags_against_master/bindiff_against_master/origin_readiopdata_merge2/clubb/src/readiopdata_core/readiopdata_core_module.F90:785:28:

  785 |    lhf_in(:) = missing_value
      |                            ^
Warning: 'lhf_in.dim[0].ubound' may be used uninitialized [-Wmaybe-uninitialized]
/home/jenkins/workspace/run_bindiff_w_varying_flags_against_master/bindiff_against_master/origin_readiopdata_merge2/clubb/src/readiopdata_core/readiopdata_core_module.F90:759:45:

  759 |     real, allocatable :: shf_in(:), lhf_in(:), tausrf_in(:), tmp_srf(:), Tg_in(:)
      |                                             ^
note: 'lhf_in' declared here
/home/jenkins/workspace/run_bindiff_w_varying_flags_against_master/bindiff_against_master/origin_readiopdata_merge2/clubb/src/readiopdata_core/readiopdata_core_module.F90:785:28:

  785 |    lhf_in(:) = missing_value
      |                            ^
Warning: 'lhf_in.offset' may be used uninitialized [-Wmaybe-uninitialized]
/home/jenkins/workspace/run_bindiff_w_varying_flags_against_master/bindiff_against_master/origin_readiopdata_merge2/clubb/src/readiopdata_core/readiopdata_core_module.F90:759:45:

  759 |     real, allocatable :: shf_in(:), lhf_in(:), tausrf_in(:), tmp_srf(:), Tg_in(:)
      |                                             ^
note: 'lhf_in' declared here
/home/jenkins/workspace/run_bindiff_w_varying_flags_against_master/bindiff_against_master/origin_readiopdata_merge2/clubb/src/readiopdata_core/readiopdata_core_module.F90:785:28:

  785 |    lhf_in(:) = missing_value
      |                            ^
Warning: 'lhf_in.dim[0].lbound' may be used uninitialized [-Wmaybe-uninitialized]
/home/jenkins/workspace/run_bindiff_w_varying_flags_against_master/bindiff_against_master/origin_readiopdata_merge2/clubb/src/readiopdata_core/readiopdata_core_module.F90:759:45:

  759 |     real, allocatable :: shf_in(:), lhf_in(:), tausrf_in(:), tmp_srf(:), Tg_in(:)
      |                                             ^
note: 'lhf_in' declared here
/home/jenkins/workspace/run_bindiff_w_varying_flags_against_master/bindiff_against_master/origin_readiopdata_merge2/clubb/src/readiopdata_core/readiopdata_core_module.F90:785:28:

  785 |    lhf_in(:) = missing_value
      |                            ^
Warning: 'lhf_in.dim[0].ubound' may be used uninitialized [-Wmaybe-uninitialized]
/home/jenkins/workspace/run_bindiff_w_varying_flags_against_master/bindiff_against_master/origin_readiopdata_merge2/clubb/src/readiopdata_core/readiopdata_core_module.F90:759:45:

  759 |     real, allocatable :: shf_in(:), lhf_in(:), tausrf_in(:), tmp_srf(:), Tg_in(:)
      |                                             ^
note: 'lhf_in' declared here
/home/jenkins/workspace/run_bindiff_w_varying_flags_against_master/bindiff_against_master/origin_readiopdata_merge2/clubb/src/readiopdata_core/readiopdata_core_module.F90:786:31:

  786 |    tausrf_in(:) = missing_value
      |                               ^
Warning: 'tausrf_in.dim[0].ubound' may be used uninitialized [-Wmaybe-uninitialized]
/home/jenkins/workspace/run_bindiff_w_varying_flags_against_master/bindiff_against_master/origin_readiopdata_merge2/clubb/src/readiopdata_core/readiopdata_core_module.F90:759:59:

  759 |     real, allocatable :: shf_in(:), lhf_in(:), tausrf_in(:), tmp_srf(:), Tg_in(:)
      |                                                           ^
note: 'tausrf_in.dim[0].ubound' was declared here
[827/927] Building Fortran object src/Input_fields/CMakeFiles/input_fields_lib.dir/__/readiopdata_module.F90.o
FAILED: src/Input_fields/CMakeFiles/input_fields_lib.dir/__/readiopdata_module.F90.o MOD/readiopdata_module.mod 
/usr/local/spack/opt/spack/linux-pop22-cascadelake/gcc-12.2.0/gcc-13.1.0-uswx4gd4eee2bf3orriqppfr4j25x4li/bin/gfortran -I/home/jenkins/workspace/run_bindiff_w_varying_flags_against_master/bindiff_against_master/origin_readiopdata_merge2/clubb/src -I/home/jenkins/workspace/run_bindiff_w_varying_flags_against_master/bindiff_against_master/origin_readiopdata_merge2/clubb/build/gcc_PRECdouble/MOD -I/usr/local/spack/opt/spack/linux-pop22-cascadelake/gcc-13.1.0/netcdf-fortran-4.5.3-ivafocv4fav4rj3ckswo6vj33utvtdir/include -mieee-fp -fall-intrinsics -std=gnu -fallow-argument-mismatch -Wall -Wextra -Wconversion -Wunderflow -Wcharacter-truncation -pedantic -O2 -march=native -msse3 -mfpmath=sse -JMOD -fPIC -fpreprocessed -c src/Input_fields/CMakeFiles/input_fields_lib.dir/__/readiopdata_module.F90-pp.f90 -o src/Input_fields/CMakeFiles/input_fields_lib.dir/__/readiopdata_module.F90.o
/home/jenkins/workspace/run_bindiff_w_varying_flags_against_master/bindiff_against_master/origin_readiopdata_merge2/clubb/src/readiopdata_module.F90:244:9:

  244 |     use spec_hum_to_mixing_ratio, only: &
      |         1
Fatal Error: Cannot open module file 'spec_hum_to_mixing_ratio.mod' for reading at (1): No such file or directory
compilation terminated.
[828/927] Building Fortran object src/Input_fields/CMakeFiles/input_fields_lib.dir/input_fields.F90.o
ninja: build stopped: subcommand failed.

Build failed. See /home/jenkins/workspace/run_bindiff_w_varying_flags_against_master/bindiff_against_master/origin_readiopdata_merge2/clubb/build/gcc_PRECdouble/cmake_build_output.txt for details.
Cloning master into /home/jenkins/workspace/run_bindiff_w_varying_flags_against_master/bindiff_against_master/master/clubb...
Running: git clone https://github.com/larson-group/clubb.git /home/jenkins/workspace/run_bindiff_w_varying_flags_against_master/bindiff_against_master/master/clubb
Running: git checkout master (cwd=/home/jenkins/workspace/run_bindiff_w_varying_flags_against_master/bindiff_against_master/master/clubb)
Compiling CLUBB for master...
Running: /usr/bin/python3 /home/jenkins/workspace/run_bindiff_w_varying_flags_against_master/bindiff_against_master/master/clubb/compile.py (cwd=/home/jenkins/workspace/run_bindiff_w_varying_flags_against_master/bindiff_against_master/master/clubb)

Running varying-flag cases for master...
Run phase for master exited with code 1; continuing to output comparison.
Cloning origin/readiopdata_merge2 into /home/jenkins/workspace/run_bindiff_w_varying_flags_against_master/bindiff_against_master/origin_readiopdata_merge2/clubb...
Running: git clone https://github.com/larson-group/clubb.git /home/jenkins/workspace/run_bindiff_w_varying_flags_against_master/bindiff_against_master/origin_readiopdata_merge2/clubb
Running: git checkout origin/readiopdata_merge2 (cwd=/home/jenkins/workspace/run_bindiff_w_varying_flags_against_master/bindiff_against_master/origin_readiopdata_merge2/clubb)
Compiling CLUBB for origin/readiopdata_merge2...
Running: /usr/bin/python3 /home/jenkins/workspace/run_bindiff_w_varying_flags_against_master/bindiff_against_master/origin_readiopdata_merge2/clubb/compile.py (cwd=/home/jenkins/workspace/run_bindiff_w_varying_flags_against_master/bindiff_against_master/origin_readiopdata_merge2/clubb)
Command failed for origin/readiopdata_merge2 with exit code 1.
[Pipeline] }
[Pipeline] // stage
[Pipeline] }
[Pipeline] // withEnv
[Pipeline] }
[Pipeline] // node
[Pipeline] End of Pipeline
ERROR: script returned exit code 1
Finished: FAILURE